{"text_format":"1","workbook":"xlsx","n_sheets":5,"sheets":["1. ENTER DATA","2. RESULTS","3. CALCS_Loads","4. CALCS_Infiltration","5.CALCS_Adams&Papa"],"not_rendered":{"charts":11,"images":1,"macros":1,"external_links":0,"defined_names":94,"comments":1,"pivot_tables":0},"unopened":[],"bounds":{"document_bytes":16777216,"sheet_cells":100000,"rows_first":2000,"rows_last":500,"rows_between":2000,"halvings":0,"cell_chars":16384,"cell_head_chars":4096},"cells_cut":0,"cells_raw":0,"read":"whole","date_system":"1900"}

{"sheet":"1. ENTER DATA","index":0,"n_rows":82,"n_cols":22,"rows_kept":82,"cut":false,"hidden":false,"merged":[[1,16,1,21],[23,1,23,3],[24,1,24,3],[11,1,11,2],[14,1,14,3],[10,1,10,7],[22,1,22,7],[0,1,0,7],[81,9,81,10],[58,9,58,10],[42,1,42,3],[53,1,53,3],[52,1,52,3],[48,1,48,3],[46,1,46,3],[57,1,57,3],[51,1,51,3],[50,1,50,3],[45,1,45,3],[35,1,35,3],[1,1,1,7],[28,1,28,3],[27,9,27,10],[59,1,59,7],[55,1,55,3],[25,1,25,3],[26,1,26,3],[40,1,40,3],[36,1,36,3],[31,1,31,3],[41,1,41,3],[34,1,34,3],[33,1,33,3],[30,1,30,3],[32,1,32,3],[54,1,54,3],[29,1,29,3],[27,1,27,3]]}
["Row","STORMWATER LOAD ANALYSIS TOOL (SLAT) - Beta Version"]
[2,"For full instructions, see user manual.",null,null,null,null,null,null,null,null,null,null,null,null,null,null,"Internal Lists"]
[{"$f":"A2+1","v":3},"(1) Enable Macros in the worksheet."]
[4,"(2) If performing a new analysis, click \"Restore Defaults\" button to the right.",null,null,null,null,null,null,null,null,null,null,null,null,null,null,"BMP 1 Options","BMP 2 Options","Conveyance Options","WQV Options","Drainage areas","Infiltration Field Options"]
[5,"(3) Answer questions in the yellow cells. Move vertically from top to bottom.",null,null,null,null,null,null,null,null,null,null,null,null,null,null,"None","None","Pumped","Yes",1,"Irrigation"]
[6,"(4) Click \"View Full Results\" button at bottom. ",null,null,null,null,null,null,null,null,null,null,null,null,null,null,"Biofiltration","Infiltration Field","Gravity Drained","No",2,"Level spread"]
[7,"Note: This worksheet assumes: SCMs IN SERIES that treat a specified drainage area, and the second SCM only receives treated volume (not bypass/overflow) from the first SCM. ",null,null,null,null,null,null,null,null,null,null,null,null,null,null,"Retention Basin","Beneficial Reuse",null,null,3,"N/A"]
[8,null,null,null,null,null,null,null,null,null,null,null,null,null,null,null,"Rainwater Harvesting","Alternative",null,null,4]
[9,"KEY","Required User Input","Key User Input","Internal Calculation","Error","Calculator Output","Does Not Apply",null,null,null,null,null,null,null,null,"Sedimentation/Filtration",null,null,"Splitter Options"]
[10,null,null,null,null,null,null,null,null,null,null,null,null,null,null,null,"Alternative",null,null,"Yes (Off-Line)"]
[11,"Step 1: Input site characteristics in yellow highlighted cells",null,null,null,null,null,null,null,null,null,null,null,null,null,null,null,null,null,"No (On-Line)"]
[12,"Site Name",null,null,"Editor Name",null,"Date","SLAT Beta - 8/2014",null,"Simplified Schematic"]
[13,null,null,null,null,null,null,null,null,null,null,null,null,null,null,null,"FOR PLOTTING",null,null,"Infiltration Options","Infiltration Field Options"]
[14,"Is your site within the Barton Springs Zone? ",null,null,"Yes",null,null,null,null,null,null,null,null,null,null,null,"Captions",null,null,"Yes","Yes"]
[15,"How many drainage areas, nmax, does your site have? ",null,null,1,null,null,null,null,null,null,null,null,null,null,null,"Existing","Developed, Untreated","Proposed","No; infiltrate all routed water","No; calculate area"]
[16,null,null,null,"Drainage Area A","Drainage Area B","Drainage Area C","Drainage Area D"]
[17,"Drainage area to the control, An (Acres)",null,null,1,1,1,1,null,null,null,null,null,null,null,null,"Baseline Loads",null,null,"Compliance Factor"]
[18,"Base impervious cover of the drainage area, ICB (%)",null,null,0,0,0,0,null,null,null,null,null,null,null,null,null,null,null,"Compliance Factor (Compare to Baseline)"]
[19,"Developed impervious cover of the drainage area, ICD (%)",null,null,0,0,0,0,null,null,null,null,null,null,null,null,null,null,null,"Compliance Factor (Compare to Sed/Fil)"]
[20,"Annual average runoff for existing site, VEx (in/yr)",null,null,{"$f":"'3. CALCS_Loads'!C83","v":1.1845187709210347},{"$f":"'3. CALCS_Loads'!D83","v":0},{"$f":"'3. CALCS_Loads'!E83","v":0},{"$f":"'3. CALCS_Loads'!M16","v":0}]
[21,"Annual average runoff for developed site, Vd (in/yr)",null,null,{"$f":"'3. CALCS_Loads'!C88","v":1.1845187709210347},{"$f":"'3. CALCS_Loads'!D88","v":0},{"$f":"'3. CALCS_Loads'!E88","v":0},{"$f":"'3. CALCS_Loads'!F88","v":0}]
[22]
[23,"Step 2: Input SCM characteristics in yellow highlighted cells"]
[24,null,null,null,"Drainage Area A","Drainage Area B","Drainage Area C","Drainage Area D"]
[25,"SCM 1 (First in Series)",null,null,"SCM A1","SCM B1","SCM C1","SCM D1"]
[26,"SCM Type",null,null,"Retention Basin","Retention Basin","Retention Basin","Retention Basin"]
[27,"Is SCM 1 off-line?",null,null,"Yes (Off-Line)","Yes (Off-Line)","Yes (Off-Line)","Yes (Off-Line)"]
[28,"What is the water quality volume, WQV, (in)?",null,null,2.5,2.5,2.5,2.5,null,{"$f":"'2. RESULTS'!G18","v":"COMPLIANT"}]
[29,"Minimum water quality volume (1/2\" Plus Rule)",null,null,{"$f":"'3. CALCS_Loads'!C93","v":0.5},{"$f":"'3. CALCS_Loads'!D93","v":0.5},{"$f":"'3. CALCS_Loads'!E93","v":0.5},{"$f":"'3. CALCS_Loads'!F93","v":0.5}]
[30,"SCM 1 Actual Volume (ft3)",null,null,{"$f":"WQV_A1*DA_A*3630","v":9075},{"$f":"WQV_B1*DA_B*3630","v":9075},{"$f":"WQV_C1*DA_C*3630","v":9075},{"$f":"WQV_D1*DA_D*3630","v":9075}]
[31,"Drawdown Time, DDT (hrs)",null,null,60,60,60,60]
[32,"Do you already know the runoff capture efficiency? ",null,null,"No","No","No","No"]
[33,"User Entered Runoff Capture Efficiency, RCE (%)",null,null,0,0,0,0]
[34,"Runoff Capture Efficiency, RCE (%)",null,null,{"$f":"IF(E26=\"None\",0,IF(E32=\"Yes\",E33,RCE_A1_AP*100))","v":99.953062408075681},{"$f":"IF(F26=\"None\",0,IF(F32=\"Yes\",F33,RCE_B1_AP*100))","v":99.953062408075681},{"$f":"IF(G26=\"None\",0,IF(G32=\"Yes\",G33,RCE_C1_AP*100))","v":99.953062408075681},{"$f":"IF(H26=\"None\",0,IF(H32=\"Yes\",H33,RCE_D1_AP*100))","v":99.953062408075681}]
[35,"Annual average volume treated by SCM 1, VT,1 (in/yr)",null,null,{"$f":"'3. CALCS_Loads'!C144","v":1.1839627863340729},{"$f":"'3. CALCS_Loads'!D144","v":0},{"$f":"'3. CALCS_Loads'!E144","v":0},{"$f":"'3. CALCS_Loads'!F144","v":0}]
[36,"Annual average bypass volume, Vby,1 (in/yr)",null,null,{"$f":"'3. CALCS_Loads'!C146","v":5.5598458696182185E-4},{"$f":"'3. CALCS_Loads'!D146","v":0},{"$f":"'3. CALCS_Loads'!E146","v":0},{"$f":"'3. CALCS_Loads'!F146","v":0}]
[37,"Conveyance"]
[38,"How is effluent from SCM 1 discharged?",null,null,"Pumped","Pumped","Pumped","Pumped"]
[39,"Delay after end of rainfall before discharging SCM 1 (hrs)",null,null,12,12,12,12]
[40]
[41,"SCM 2 (Second in Series)",null,null,"SCM A2","SCM B2","SCM C2","SCM D2"]
[42,"SCM Type",null,null,"Infiltration Field","Infiltration Field","Infiltration Field","Infiltration Field"]
[43,"Percent of SCM 1's WQV routed to SCM 2",null,null,100,100,100,100]
[44,"Water quality volume routed to SCM 2 (in)",null,null,{"$f":"E43*WQV_A1/100","v":2.5},{"$f":"F43*WQV_B1/100","v":2.5},{"$f":"G43*WQV_C1/100","v":2.5},{"$f":"H43*WQV_D1/100","v":2.5}]
[{"$f":"A44+1","v":45},"Annual volume routed to SCM 2, VT,2+Vinf (in/yr)",null,null,{"$f":"'3. CALCS_Loads'!C150","v":1.1839627863340727},{"$f":"'3. CALCS_Loads'!D150","v":0},{"$f":"'3. CALCS_Loads'!E150","v":0},{"$f":"'3. CALCS_Loads'!F150","v":0}]
[{"$f":"A45+1","v":46},"Does SCM 2 reduce volume, such as by infiltration?",null,null,"Yes","Yes","Yes","Yes"]
[47,"Do you already know the infiltrated water quality volume? ",null,null,"No; infiltrate all routed water","No; infiltrate all routed water","No; infiltrate all routed water","No; infiltrate all routed water"]
[{"$f":"A47+1","v":48},"User-entered infilt. water quality volume, WQVinf (in)",null,null,0,0,0,0]
[49,"Annual Infiltrated Volume, Vinf (in/yr)",null,null,{"$f":"'3. CALCS_Loads'!C152","v":1.1839627863340727},{"$f":"'3. CALCS_Loads'!D152","v":0},{"$f":"'3. CALCS_Loads'!E152","v":0},{"$f":"'3. CALCS_Loads'!F152","v":0}]
[50,"Annual Non-Infilt. Volume Treated by SCM 2, VT,2 (in/yr)",null,null,{"$f":"'3. CALCS_Loads'!C154","v":0},{"$f":"'3. CALCS_Loads'!D154","v":0},{"$f":"'3. CALCS_Loads'!E154","v":0},{"$f":"'3. CALCS_Loads'!F154","v":0}]
[51,"How is water applied to the infiltration field?",null,null,"Irrigation","Irrigation","Irrigation","Irrigation"]
[{"$f":"A51+1","v":52},"Number of application zones",null,null,2,2,2,2]
[53,"Soil infiltration rate (in/hr)",null,null,0.2,0.2,0.2,0.2]
[54,"Total application time, tapp (hrs)",null,null,{"$f":"DDT_A1","v":60},{"$f":"DDT_B1","v":60},{"$f":"DDT_C1","v":60},{"$f":"DDT_D1","v":60}]
[55,"Do you know the infiltration field area?",null,null,"No; calculate area","No; calculate area","No; calculate area","No; calculate area"]
[56,"User-Entered Infiltration Field Area (Ac)",null,null,0,0,0,0]
[57,"Calculated Field Area for Given Volume (Ac)",null,null,{"$f":"'4. CALCS_Infiltration'!E39","v":0.41666666666666669},{"$f":"'4. CALCS_Infiltration'!F39","v":0.41666666666666669},{"$f":"'4. CALCS_Infiltration'!G39","v":0.41666666666666669},{"$f":"'4. CALCS_Infiltration'!H39","v":0.41666666666666669}]
[58,"Min. Field Area for Load Compliance (Ac)",null,null,{"$f":"ROUNDUP('4. CALCS_Infiltration'!E33,3)","v":2E-3},{"$f":"ROUNDUP('4. CALCS_Infiltration'!F33,3)","v":2E-3},{"$f":"ROUNDUP('4. CALCS_Infiltration'!G33,3)","v":2E-3},{"$f":"ROUNDUP('4. CALCS_Infiltration'!H33,3)","v":2E-3}]
[59,null,null,null,null,null,null,null,null,{"$f":"J28","v":"COMPLIANT"}]
[60,"Step 3: Input Effluent Data for Alternative SCMs"]
[61,null,null,null,"Drainage Area A","Drainage Area B","Drainage Area C","Drainage Area D"]
[62,null,null,null,"SCM A1","SCM B1","SCM C1","SCM D1"]
[63,null,"Pollutant","Units",{"$f":"E26","v":"Retention Basin"},{"$f":"F26","v":"Retention Basin"},{"$f":"G26","v":"Retention Basin"},{"$f":"H26","v":"Retention Basin"}]
[64,null,"COD","mg/L"]
[65,null,"E. coli","CFU/100mL"]
[66,null,"Pb","mg/L"]
[67,null,"TN","mg/L"]
[{"$f":"A67+1","v":68},null,"TOC","mg/L"]
[{"$f":"A68+1","v":69},null,"TP","mg/L"]
[70,null,"TSS","mg/L"]
[71,null,"Zn","mg/L"]
[72,null,null,null,{"$f":"E41","v":"SCM A2"},"SCM B2","SCM C2",{"$f":"H41","v":"SCM D2"}]
[73,null,"Pollutant",null,"Infiltration Field","Infiltration Field","Infiltration Field",{"$f":"H42","v":"Infiltration Field"}]
[74,null,"COD","mg/L"]
[75,null,"E. coli","CFU/100mL"]
[76,null,"Pb","mg/L"]
[77,null,"TN","mg/L"]
[78,null,"TOC","mg/L"]
[79,null,"TP","mg/L"]
[80,null,"TSS","mg/L"]
[81,null,"Zn","mg/L"]
[82,null,null,null,null,null,null,null,null,{"$f":"J59","v":"COMPLIANT"}]

{"sheet":"2. RESULTS","index":1,"n_rows":39,"n_cols":19,"rows_kept":39,"cut":false,"hidden":false,"merged":[[0,10,0,17],[5,8,6,8],[34,4,35,4],[34,3,35,3],[5,0,6,1],[5,7,6,7],[5,9,6,9],[34,5,35,5],[26,0,26,2],[28,5,30,5],[17,6,18,7],[28,4,30,4],[34,7,35,7],[28,3,30,3],[28,0,30,2],[33,0,33,2],[38,0,38,2],[28,6,30,6],[34,6,35,6],[5,2,5,6],[0,0,0,7],[27,0,27,2],[28,7,30,7],[37,0,37,2],[36,0,36,2],[34,0,35,2],[32,0,32,2],[31,0,31,2]]}
["SLAT: Stormwater Load Analysis Tool",null,null,null,null,null,null,null,null,"1/2","SLAT: Stormwater Load Analysis Tool",null,null,null,null,null,null,null,"2/2"]
["Site Name:",{"$f":"'1. ENTER DATA'!B12","v":"Site Name"},null,null,"By:",{"$f":"'1. ENTER DATA'!E12","v":"Editor Name"},null,"Date:",{"$f":"'1. ENTER DATA'!G12","v":"Date"},null,"Site Name:",{"$f":"B2","v":"Site Name"},null,null,"By:",{"$f":"F2","v":"Editor Name"},null,"Date:",{"$f":"I2","v":"Date"}]
["RESULTS: COMPLIANCE TABLE",null,null,null,null,null,null,null,null,{"$f":"'1. ENTER DATA'!H12","v":"SLAT Beta - 8/2014"},"RESULTS: PLOTS",null,null,null,null,null,null,null,{"$f":"'1. ENTER DATA'!H12","v":"SLAT Beta - 8/2014"}]
[]
[]
["POLLUTANT",null,"DEVELOPED LOAD, WITH CONTROLS",null,null,null,null,{"$f":"IF('1. ENTER DATA'!E14=\"Yes\",\"EXISTING LOAD, L_Ex\",\"SED/FIL LOAD\")","v":"EXISTING LOAD, L_Ex"},"LOAD EQUIV. FACTOR, LEF","COMPLIES?"]
[null,null,"Drainage Area A","Drainage Area B","Drainage Area C","Drainage Area D","TOTAL LOAD, Lout"]
["COD","lbs/yr",{"$f":"'3. CALCS_Loads'!Z178","v":3.145137382800792E-3},{"$f":"'3. CALCS_Loads'!AA178","v":0},{"$f":"'3. CALCS_Loads'!AB178","v":0},{"$f":"'3. CALCS_Loads'!AC178","v":0},{"$f":"SUM(C8:F8)","v":3.145137382800792E-3},{"$f":"IF('1. ENTER DATA'!$E$14=\"Yes\",'3. CALCS_Loads'!AD178,'3. CALCS_Loads'!AE178)","v":10.445832768807366},{"$f":"IF('1. ENTER DATA'!$E$14=\"Yes\",'3. CALCS_Loads'!AH178,'3. CALCS_Loads'!AI178)","v":3.0109015263891524E-4},{"$f":"IF('1. ENTER DATA'!$E$14=\"Yes\",'3. CALCS_Loads'!AJ178,'3. CALCS_Loads'!AK178)","v":"YES"}]
["E. coli","10^6 MPN/yr",{"$f":"'3. CALCS_Loads'!Z179","v":4.7029872910259956},{"$f":"'3. CALCS_Loads'!AA179","v":0},{"$f":"'3. CALCS_Loads'!AB179","v":0},{"$f":"'3. CALCS_Loads'!AC179","v":0},{"$f":"SUM(C9:F9)","v":4.7029872910259956},{"$f":"IF('1. ENTER DATA'!$E$14=\"Yes\",'3. CALCS_Loads'!AD179,'3. CALCS_Loads'!AE179)","v":10193.469623240113},{"$f":"IF('1. ENTER DATA'!$E$14=\"Yes\",'3. CALCS_Loads'!AH179,'3. CALCS_Loads'!AI179)","v":4.6137257134740904E-4},{"$f":"IF('1. ENTER DATA'!$E$14=\"Yes\",'3. CALCS_Loads'!AJ179,'3. CALCS_Loads'!AK179)","v":"YES"}]
["Pb","lbs/yr",{"$f":"'3. CALCS_Loads'!Z180","v":5.3983662621656143E-7},{"$f":"'3. CALCS_Loads'!AA180","v":0},{"$f":"'3. CALCS_Loads'!AB180","v":0},{"$f":"'3. CALCS_Loads'!AC180","v":0},5.3983662621656143E-7,{"$f":"IF('1. ENTER DATA'!$E$14=\"Yes\",'3. CALCS_Loads'!AD180,'3. CALCS_Loads'!AE180)","v":1.1501157261902815E-3},{"$f":"IF('1. ENTER DATA'!$E$14=\"Yes\",'3. CALCS_Loads'!AH180,'3. CALCS_Loads'!AI180)","v":4.693759192431457E-4},{"$f":"IF('1. ENTER DATA'!$E$14=\"Yes\",'3. CALCS_Loads'!AJ180,'3. CALCS_Loads'!AK180)","v":"YES"}]
["TN","lbs/yr",{"$f":"'3. CALCS_Loads'!Z181","v":1.6842875663676288E-4},{"$f":"'3. CALCS_Loads'!AA181","v":0},{"$f":"'3. CALCS_Loads'!AB181","v":0},{"$f":"'3. CALCS_Loads'!AC181","v":0},1.6842875663676288E-4,{"$f":"IF('1. ENTER DATA'!$E$14=\"Yes\",'3. CALCS_Loads'!AD181,'3. CALCS_Loads'!AE181)","v":0.31955118238768027},{"$f":"IF('1. ENTER DATA'!$E$14=\"Yes\",'3. CALCS_Loads'!AH181,'3. CALCS_Loads'!AI181)","v":5.2707912196808804E-4},{"$f":"IF('1. ENTER DATA'!$E$14=\"Yes\",'3. CALCS_Loads'!AJ181,'3. CALCS_Loads'!AK181)","v":"YES"}]
["TOC","lbs/yr",{"$f":"'3. CALCS_Loads'!Z182","v":1.1988437757766395E-3},{"$f":"'3. CALCS_Loads'!AA182","v":0},{"$f":"'3. CALCS_Loads'!AB182","v":0},{"$f":"'3. CALCS_Loads'!AC182","v":0},{"$f":"SUM(C12:F12)","v":1.1988437757766395E-3},{"$f":"IF('1. ENTER DATA'!$E$14=\"Yes\",'3. CALCS_Loads'!AD182,'3. CALCS_Loads'!AE182)","v":3.4989511819424157},{"$f":"IF('1. ENTER DATA'!$E$14=\"Yes\",'3. CALCS_Loads'!AH182,'3. CALCS_Loads'!AI182)","v":3.4262946621367569E-4},{"$f":"IF('1. ENTER DATA'!$E$14=\"Yes\",'3. CALCS_Loads'!AJ182,'3. CALCS_Loads'!AK182)","v":"YES"}]
["TP","lbs/yr",{"$f":"'3. CALCS_Loads'!Z183","v":2.1114560025418703E-5},{"$f":"'3. CALCS_Loads'!AA183","v":0},{"$f":"'3. CALCS_Loads'!AB183","v":0},{"$f":"'3. CALCS_Loads'!AC183","v":0},2.1114560025418703E-5,{"$f":"IF('1. ENTER DATA'!$E$14=\"Yes\",'3. CALCS_Loads'!AD183,'3. CALCS_Loads'!AE183)","v":3.329777026560702E-2},{"$f":"IF('1. ENTER DATA'!$E$14=\"Yes\",'3. CALCS_Loads'!AH183,'3. CALCS_Loads'!AI183)","v":6.3411333122289422E-4},{"$f":"IF('1. ENTER DATA'!$E$14=\"Yes\",'3. CALCS_Loads'!AJ183,'3. CALCS_Loads'!AK183)","v":"YES"}]
["TSS","lbs/yr",{"$f":"'3. CALCS_Loads'!Z184","v":2.4184034042407884E-3},{"$f":"'3. CALCS_Loads'!AA184","v":0},{"$f":"'3. CALCS_Loads'!AB184","v":0},{"$f":"'3. CALCS_Loads'!AC184","v":0},2.4184034042407884E-3,{"$f":"IF('1. ENTER DATA'!$E$14=\"Yes\",'3. CALCS_Loads'!AD184,'3. CALCS_Loads'!AE184)","v":44.576047291054564},{"$f":"IF('1. ENTER DATA'!$E$14=\"Yes\",'3. CALCS_Loads'!AH184,'3. CALCS_Loads'!AI184)","v":5.4253428718120301E-5},{"$f":"IF('1. ENTER DATA'!$E$14=\"Yes\",'3. CALCS_Loads'!AJ184,'3. CALCS_Loads'!AK184)","v":"YES"}]
["Zn","lbs/yr",{"$f":"'3. CALCS_Loads'!Z185","v":2.9701727986909343E-6},{"$f":"'3. CALCS_Loads'!AA185","v":0},{"$f":"'3. CALCS_Loads'!AB185","v":0},{"$f":"'3. CALCS_Loads'!AC185","v":0},2.9701727986909343E-6,{"$f":"IF('1. ENTER DATA'!$E$14=\"Yes\",'3. CALCS_Loads'!AD185,'3. CALCS_Loads'!AE185)","v":6.3279190024921744E-3},{"$f":"IF('1. ENTER DATA'!$E$14=\"Yes\",'3. CALCS_Loads'!AH185,'3. CALCS_Loads'!AI185)","v":4.6937591924314575E-4},{"$f":"IF('1. ENTER DATA'!$E$14=\"Yes\",'3. CALCS_Loads'!AJ185,'3. CALCS_Loads'!AK185)","v":"YES"}]
[]
[]
[null,null,null,null,null,null,{"$f":"IF(I8<=1,IF(I9<=1,IF(I10<=1,IF(I11<=1,IF(I13<=1,IF(I14<=1,IF(I15<=1,\"COMPLIANT\",\"NOT COMPLIANT\"),\"NOT COMPLIANT\"),\"NOT COMPLIANT\"),\"NOT COMPLIANT\"),\"NOT COMPLIANT\"),\"NOT COMPLIANT\"),\"NOT COMPLIANT\")","v":"COMPLIANT"}]
[]
[]
[]
[]
[]
["SUMMARY OF INPUTS"]
[]
[null,null,null,"Drainage Area A","Drainage Area B","Drainage Area C","Drainage Area D","TOTALS"]
["Drainage Area, An (Ac)",null,null,{"$f":"DA_A","v":1},{"$f":"IF(n_DA=1,\"N/A\",DA_B)","v":"N/A"},{"$f":"IF(n_DA<3,\"N/A\",DA_C)","v":"N/A"},{"$f":"IF(n_DA<4,\"N/A\",DA_D)","v":"N/A"},{"$f":"SUM(D27:G27)","v":1}]
["Developed IC, ICD (%)",null,null,{"$f":"ICA_d","v":0},{"$f":"IF(n_DA=1,\"N/A\",ICB_d)","v":"N/A"},{"$f":"IF(n_DA<3,\"N/A\",ICC_d)","v":"N/A"},{"$f":"IF(n_DA<4,\"N/A\",ICD_d)","v":"N/A"},{"$f":"(D28*D27+IF(n_DA>1,E28*E27,0)+IF(n_DA>2,F28*F27,0)+IF(n_DA>3,G28*G27,0))/(100*H27)","v":0}]
["SCM 1",null,null,{"$f":"'1. ENTER DATA'!E26","v":"Retention Basin"},{"$f":"IF(n_DA=1,\"N/A\",'1. ENTER DATA'!F26)","v":"N/A"},{"$f":"IF(n_DA<3,\"N/A\",'1. ENTER DATA'!G26)","v":"N/A"},{"$f":"IF(n_DA<4,\"N/A\",'1. ENTER DATA'!H26)","v":"N/A"},"-"]
[]
[]
["Water Qual. Vol, WQV (in)",null,null,{"$f":"WQV_A1","v":2.5},{"$f":"IF(n_DA=1,\"N/A\",WQV_B1)","v":"N/A"},{"$f":"IF(n_DA<3,\"N/A\",WQV_C1)","v":"N/A"},{"$f":"IF(n_DA<4,\"N/A\",WQV_D1)","v":"N/A"},"-"]
["Actual Volume (ft3)",null,null,{"$f":"D32*D27/12*43560","v":9075},{"$f":"IF(n_DA=1,\"N/A\",E32*E27/12*43560)","v":"N/A"},{"$f":"IF(n_DA<3,\"N/A\",F32*F27/12*43560)","v":"N/A"},{"$f":"IF(n_DA<4,\"N/A\",G32*G27/12*43560)","v":"N/A"},{"$f":"SUM(D33:G33)","v":9075}]
["Drawdown Time, DDT (hrs)",null,null,{"$f":"DDT_A1","v":60},{"$f":"IF(n_DA=1,\"N/A\",DDT_B1)","v":"N/A"},{"$f":"IF(n_DA<3,\"N/A\",DDT_C1)","v":"N/A"},{"$f":"IF(n_DA<4,\"N/A\",DDT_D1)","v":"N/A"},"-"]
["SCM 2",null,null,{"$f":"'1. ENTER DATA'!E42","v":"Infiltration Field"},{"$f":"IF(n_DA=1,\"N/A\",'1. ENTER DATA'!F42)","v":"N/A"},{"$f":"IF(n_DA<3,\"N/A\",'1. ENTER DATA'!G42)","v":"N/A"},{"$f":"IF(n_DA<4,\"N/A\",'1. ENTER DATA'!H42)","v":"N/A"},"-"]
[]
["Infiltration Rate (in/hr)",null,null,{"$f":"'1. ENTER DATA'!E53","v":0.2},{"$f":"IF(n_DA=1,\"N/A\",'1. ENTER DATA'!F53)","v":"N/A"},{"$f":"IF(n_DA<3,\"N/A\",'1. ENTER DATA'!G53)","v":"N/A"},{"$f":"IF(n_DA<4,\"N/A\",'1. ENTER DATA'!H53)","v":"N/A"},"-"]
["Infiltration Field Area (Ac)",null,null,{"$f":"'4. CALCS_Infiltration'!E37","v":0.41666666666666669},{"$f":"IF(n_DA=1,\"N/A\",'4. CALCS_Infiltration'!F37)","v":"N/A"},{"$f":"IF(n_DA<3,\"N/A\",'4. CALCS_Infiltration'!G37)","v":"N/A"},{"$f":"IF(n_DA<4,\"N/A\",'4. CALCS_Infiltration'!H37)","v":"N/A"},{"$f":"SUM(D38:G38)","v":0.41666666666666669}]
["Error with Input Values?",null,null,{"$f":"IF(OR(AND('1. ENTER DATA'!E47=\"Yes\",'1. ENTER DATA'!E48>'1. ENTER DATA'!E44),AND('1. ENTER DATA'!E55=\"Yes\",'1. ENTER DATA'!E56<'1. ENTER DATA'!E57)),\"YES\",\"NO\")","v":"NO"},{"$f":"IF(OR(AND('1. ENTER DATA'!F47=\"Yes\",'1. ENTER DATA'!F48>'1. ENTER DATA'!F44),AND('1. ENTER DATA'!F55=\"Yes\",'1. ENTER DATA'!F56<'1. ENTER DATA'!F57)),\"YES\",\"NO\")","v":"NO"},{"$f":"IF(OR(AND('1. ENTER DATA'!G47=\"Yes\",'1. ENTER DATA'!G48>'1. ENTER DATA'!G44),AND('1. ENTER DATA'!G55=\"Yes\",'1. ENTER DATA'!G56<'1. ENTER DATA'!G57)),\"YES\",\"NO\")","v":"NO"},{"$f":"IF(OR(AND('1. ENTER DATA'!H47=\"Yes\",'1. ENTER DATA'!H48>'1. ENTER DATA'!H44),AND('1. ENTER DATA'!H55=\"Yes\",'1. ENTER DATA'!H56<'1. ENTER DATA'!H57)),\"YES\",\"NO\")","v":"NO"}]

{"sheet":"3. CALCS_Loads","index":2,"n_rows":208,"n_cols":37,"rows_kept":208,"cut":false,"hidden":false,"merged":[[61,0,63,0],[160,1,160,16],[174,30,175,30],[174,29,175,29],[161,13,161,16],[161,9,161,12],[161,5,161,8],[61,16,61,17],[61,18,61,19],[61,20,61,21],[175,21,175,24],[175,13,175,16],[175,9,175,12],[175,5,175,8],[175,1,175,4],[161,1,161,4],[34,8,34,11],[34,3,34,7],[174,36,176,36],[174,35,176,35],[160,21,161,24],[160,17,161,20],[175,17,175,20],[175,25,175,28],[174,32,175,32],[174,31,175,31]]}
["CONSTANTS"]
[31.73,"R, annual rainfall, in/yr","(CM-09-04, Pg 51)"]
[79.33,"Annual no. rainfall events, θ, events/yr"]
[]
["CONVERSION FACTORS"]
["CF_1","Pollutant in mg/L",0.22670000000000001,"lb-L/(mg-Ac-in)","Outputs to lb/Ac-yr"]
["CF_2","Pollutant in MPN/100 mL",1.0279,"100 mL/(Ac-in)","Outputs to 10^6 MPN/Ac-yr"]
[]
["ECM TABLE 1.9: Runoff (From Table 3.2, CM-09-03)"]
["IC (%)","Rv","Sd","Runoff Events","Runoff (in)"]
[0,6.4000000000000001E-2,0.218,46,1.18]
[5,0.1,0.19800000000000001,48.4,1.94]
[10,0.13600000000000001,0.18,50.6,2.76]
[15,0.17199999999999999,0.16300000000000001,52.8,3.63]
[20,0.20799999999999999,0.14799999999999999,54.8,4.55]
[25,0.24299999999999999,0.13400000000000001,56.7,5.52]
[30,0.27900000000000003,0.122,58.5,6.54]
[35,0.315,0.11,60.2,7.59]
[40,0.35099999999999998,0.1,61.8,8.67]
[45,0.38700000000000001,9.0999999999999998E-2,63.2,9.7799999999999994]
[50,0.42299999999999999,8.2000000000000003E-2,64.599999999999994,10.91]
[55.000000000000007,0.45800000000000002,7.4999999999999997E-2,65.8,12.06]
[60,0.49399999999999999,6.8000000000000005E-2,66.900000000000006,13.23]
[65,0.53,6.2E-2,68,14.42]
[70,0.56599999999999995,5.6000000000000001E-2,69,15.61]
[75,0.60199999999999998,5.0999999999999997E-2,69.900000000000006,16.82]
[80,0.63700000000000001,4.5999999999999999E-2,70.7,18.03]
[85,0.67300000000000004,4.2000000000000003E-2,71.5,19.239999999999998]
[90,0.70899999999999996,3.7999999999999999E-2,72.2,20.46]
[95,0.745,3.4000000000000002E-2,72.8,21.69]
[100,0.78100000000000003,3.1E-2,73.400000000000006,22.91]
[]
["ECM TABLE 1.10: Pollutant Concentrations"]
["From CM-09-04, Table 4.8"]
[null,null,null,"EXISTING",null,null,null,null,"DEVELOPED"]
["Pollutant","Units","Conversion Factor","Undeveloped (0% IC) Concentration","Drainage Area A","Drainage Area B","Drainage Area C","Drainage Area D","Drainage Area A","Drainage Area B","Drainage Area C","Drainage Area D"]
["COD","mg/L","CF_1",{"$f":"38.9+66.6*ICA_b/100","v":38.9},{"$f":"38.9+66.6*ICA_b/100","v":38.9},{"$f":"38.9+66.6*ICB_b/100","v":38.9},{"$f":"38.9+66.6*ICC_b/100","v":38.9},{"$f":"38.9+66.6*ICD_b/100","v":38.9},{"$f":"38.9+66.6*ICA_d/100","v":38.9},{"$f":"38.9+66.6*ICB_d/100","v":38.9},{"$f":"38.9+66.6*ICC_d/100","v":38.9},{"$f":"38.9+66.6*ICD_d/100","v":38.9},"*Function of IC"]
["E. coli","CFU/100mL","CF_2",8372,{"$f":"IF(ICA_b=0,$D38,$I38)","v":8372},{"$f":"IF(ICB_b=0,$D38,$I38)","v":8372},{"$f":"IF(ICC_b=0,$D38,$I38)","v":8372},{"$f":"IF(ICD_b=0,$D38,$I38)","v":8372},24963,24963,24963,24963]
["Pb","mg/L","CF_1",{"$f":"(4.283*EXP(2.424*ICA_b/100))/1000","v":4.2830000000000003E-3},{"$f":"(4.283*EXP(2.424*ICA_b/100))/1000","v":4.2830000000000003E-3},{"$f":"(4.283*EXP(2.424*ICB_b/100))/1000","v":4.2830000000000003E-3},{"$f":"(4.283*EXP(2.424*ICC_b/100))/1000","v":4.2830000000000003E-3},{"$f":"(4.283*EXP(2.424*ICD_b/100))/1000","v":4.2830000000000003E-3},{"$f":"(4.283*EXP(2.424*ICA_d/100))/1000","v":4.2830000000000003E-3},{"$f":"(4.283*EXP(2.424*ICB_d/100))/1000","v":4.2830000000000003E-3},{"$f":"(4.283*EXP(2.424*ICC_d/100))/1000","v":4.2830000000000003E-3},{"$f":"(4.283*EXP(2.424*ICD_d/100))/1000","v":4.2830000000000003E-3},"*Function of IC"]
["TN","mg/L","CF_1",1.19,{"$f":"IF(ICA_b=0,$D40,$I40)","v":1.19},{"$f":"IF(ICB_b=0,$D40,$I40)","v":1.19},{"$f":"IF(ICC_b=0,$D40,$I40)","v":1.19},{"$f":"IF(ICD_b=0,$D40,$I40)","v":1.19},2.2200000000000002,2.2200000000000002,2.2200000000000002,2.2200000000000002]
["TOC","mg/L","CF_1",13.03,{"$f":"IF(ICA_b=0,$D41,$I41)","v":13.03},{"$f":"IF(ICB_b=0,$D41,$I41)","v":13.03},{"$f":"IF(ICC_b=0,$D41,$I41)","v":13.03},{"$f":"IF(ICD_b=0,$D41,$I41)","v":13.03},13.03,13.03,13.03,13.03]
["TP","mg/L","CF_1",0.124,{"$f":"IF(ICA_b=0,$D42,$I42)","v":0.124},{"$f":"IF(ICB_b=0,$D42,$I42)","v":0.124},{"$f":"IF(ICC_b=0,$D42,$I42)","v":0.124},{"$f":"IF(ICD_b=0,$D42,$I42)","v":0.124},0.39600000000000002,0.39600000000000002,0.39600000000000002,0.39600000000000002]
["TSS","mg/L","CF_1",166,{"$f":"$D43","v":166},{"$f":"$D43","v":166},{"$f":"$D43","v":166},{"$f":"$D43","v":166},166,166,166,166]
["Zn","mg/L","CF_1",{"$f":"(23.565*EXP(2.179*ICA_b/100))/1000","v":2.3565000000000003E-2},{"$f":"(23.565*EXP(2.179*ICA_b/100))/1000","v":2.3565000000000003E-2},{"$f":"(23.565*EXP(2.179*ICB_b/100))/1000","v":2.3565000000000003E-2},{"$f":"(23.565*EXP(2.179*ICC_b/100))/1000","v":2.3565000000000003E-2},{"$f":"(23.565*EXP(2.179*ICD_b/100))/1000","v":2.3565000000000003E-2},{"$f":"(23.565*EXP(2.179*ICA_d/100))/1000","v":2.3565000000000003E-2},{"$f":"(23.565*EXP(2.179*ICB_d/100))/1000","v":2.3565000000000003E-2},{"$f":"(23.565*EXP(2.179*ICC_d/100))/1000","v":2.3565000000000003E-2},{"$f":"(23.565*EXP(2.179*ICD_d/100))/1000","v":2.3565000000000003E-2},"*Function of IC"]
[]
["ECM TABLE 1.11: Treated Surface Effluent Concentrations"]
["Source: Glick et all. Impacts of Stormwater Control Measures on Water Quality in Austin, TX. CM-13-02. City of Austin Watershed Protection Department: September 2013."]
["Pollutant","Units","Biofiltration","Rainwater Harvesting","Retention Basin","Sedimentation/Filtration","Wet Pond"]
["COD","mg/L",22.4,43.79,43.79,22.4,31.58]
["E. coli","CFU/100mL",4895,11065,11065,4895,12138]
["Pb","mg/L",5.7400000000000003E-3,8.3099999999999997E-3,8.3099999999999997E-3,5.7400000000000003E-3,9.9399999999999992E-3]
["TN","mg/L",1.07,1.42,1.42,1.07,1.24]
["TOC","mg/L",7.33,11.45,11.45,7.33,7.77]
["TP","mg/L",9.9000000000000005E-2,0.224,0.224,9.9000000000000005E-2,0.21099999999999999]
["TSS","mg/L",20.62,133.80000000000001,133.80000000000001,20.62,44.6]
["Zn","mg/L",2.3E-2,4.53E-2,4.53E-2,2.3E-2,4.3880000000000002E-2]
[null,null,"*Sand or bio, equal to sed/fil","*Equal to Sedimentation","*Equal to Sedimentation"]
[]
["ECM TABLE 1.12: Bypass Concentrations As a Function of Runoff Captured"]
[]
[null,null,"Drainage Area A","Drainage Area A","Drainage Area B","Drainage Area B","Drainage Area C","Drainage Area C","Drainage Area D","Drainage Area D","Drainage Area A","Drainage Area B","Drainage Area C","Drainage Area D"]
["Pollutant",null,{"$f":"'1. ENTER DATA'!E63","v":"Retention Basin"},{"$f":"C62","v":"Retention Basin"},{"$f":"'1. ENTER DATA'!F63","v":"Retention Basin"},{"$f":"E62","v":"Retention Basin"},{"$f":"'1. ENTER DATA'!G63","v":"Retention Basin"},{"$f":"G62","v":"Retention Basin"},{"$f":"'1. ENTER DATA'!H63","v":"Retention Basin"},{"$f":"I62","v":"Retention Basin"},"Sed/Fil Equivalent",{"$f":"K62","v":"Sed/Fil Equivalent"},{"$f":"K62","v":"Sed/Fil Equivalent"},{"$f":"K62","v":"Sed/Fil Equivalent"}]
[null,"WQV",{"$f":"WQV_A1","v":2.5},{"$f":"WQV_A1","v":2.5},{"$f":"WQV_B1","v":2.5},{"$f":"WQV_B1","v":2.5},{"$f":"WQV_C1","v":2.5},{"$f":"WQV_C1","v":2.5},{"$f":"WQV_D1","v":2.5},{"$f":"WQV_D1","v":2.5},{"$f":"C93","v":0.5},{"$f":"D93","v":0.5},0.5,0.5]
[null,"Method","Yes (Off-Line)","No (On-Line)",{"$f":"C64","v":"Yes (Off-Line)"},{"$f":"D64","v":"No (On-Line)"},{"$f":"C64","v":"Yes (Off-Line)"},{"$f":"D64","v":"No (On-Line)"},{"$f":"C64","v":"Yes (Off-Line)"},{"$f":"D64","v":"No (On-Line)"},{"$f":"$E$64","v":"Yes (Off-Line)"},{"$f":"$E$64","v":"Yes (Off-Line)"},{"$f":"$E$64","v":"Yes (Off-Line)"},{"$f":"$E$64","v":"Yes (Off-Line)"}]
["COD","mg/L",{"$f":"IF(C$63>0.0053,EXP(4.493-0.5104*C$63),EXP(5.6158-212.362*C$63))","v":24.953148334792502},{"$f":"IF(D$63>0.0053,EXP(4.9161-0.5447*D$63),EXP(6.1257-228.771*D$63))","v":34.965085274290395},{"$f":"IF(E$63>0.0053,EXP(4.493-0.5104*E$63),EXP(5.6158-212.362*E$63))","v":24.953148334792502},{"$f":"IF(F$63>0.0053,EXP(4.9161-0.5447*F$63),EXP(6.1257-228.771*F$63))","v":34.965085274290395},{"$f":"IF(G$63>0.0053,EXP(4.493-0.5104*G$63),EXP(5.6158-212.362*G$63))","v":24.953148334792502},{"$f":"IF(H$63>0.0053,EXP(4.9161-0.5447*H$63),EXP(6.1257-228.771*H$63))","v":34.965085274290395},{"$f":"IF(I$63>0.0053,EXP(4.493-0.5104*I$63),EXP(5.6158-212.362*I$63))","v":24.953148334792502},{"$f":"IF(J$63>0.0053,EXP(4.9161-0.5447*J$63),EXP(6.1257-228.771*J$63))","v":34.965085274290395},{"$f":"IF(K$63>0.0053,EXP(4.493-0.5104*K$63),EXP(5.6158-212.362*K$63))","v":69.255322408603291},{"$f":"IF(L$63>0.0053,EXP(4.493-0.5104*L$63),EXP(5.6158-212.362*L$63))","v":69.255322408603291},{"$f":"IF(M$63>0.0053,EXP(4.493-0.5104*M$63),EXP(5.6158-212.362*M$63))","v":69.255322408603291},{"$f":"IF(N$63>0.0053,EXP(4.493-0.5104*N$63),EXP(5.6158-212.362*N$63))","v":69.255322408603291}]
["E. coli","CFU/100mL",{"$f":"IF(C$63>0.0091,EXP(10.1772-0.4647*C$63),EXP(10.4384-29.1718*C$63))","v":8229.24868738228},{"$f":"IF(D$63>0.0091,EXP(10.7915-0.6241*D$63),EXP(11.4771-75.97*D$63))","v":10211.297659526826},{"$f":"IF(E$63>0.0091,EXP(10.1772-0.4647*E$63),EXP(10.4384-29.1718*E$63))","v":8229.24868738228},{"$f":"IF(F$63>0.0091,EXP(10.7915-0.6241*F$63),EXP(11.4771-75.97*F$63))","v":10211.297659526826},{"$f":"IF(G$63>0.0091,EXP(10.1772-0.4647*G$63),EXP(10.4384-29.1718*G$63))","v":8229.24868738228},{"$f":"IF(H$63>0.0091,EXP(10.7915-0.6241*H$63),EXP(11.4771-75.97*H$63))","v":10211.297659526826},{"$f":"IF(I$63>0.0091,EXP(10.1772-0.4647*I$63),EXP(10.4384-29.1718*I$63))","v":8229.24868738228},{"$f":"IF(J$63>0.0091,EXP(10.7915-0.6241*J$63),EXP(11.4771-75.97*J$63))","v":10211.297659526826},{"$f":"IF(K$63>0.0091,EXP(10.1772-0.4647*K$63),EXP(10.4384-29.1718*K$63))","v":20844.595812804615},{"$f":"IF(L$63>0.0091,EXP(10.1772-0.4647*L$63),EXP(10.4384-29.1718*L$63))","v":20844.595812804615},{"$f":"IF(M$63>0.0091,EXP(10.1772-0.4647*M$63),EXP(10.4384-29.1718*M$63))","v":20844.595812804615},{"$f":"IF(N$63>0.0091,EXP(10.1772-0.4647*N$63),EXP(10.4384-29.1718*N$63))","v":20844.595812804615}]
["Pb","mg/L",{"$f":"IF(C$63>0.014,EXP(2.8821-0.4893*C$63),EXP(3.6322-54.0678*C$63))/1000","v":5.2532661133623381E-3},{"$f":"IF(D$63>0.014,EXP(3.5221-0.5291*D$63),EXP(4.2534-52.7676*D$63))/1000","v":9.0191491467805744E-3},{"$f":"IF(E$63>0.014,EXP(2.8821-0.4893*E$63),EXP(3.6322-54.0678*E$63))/1000","v":5.2532661133623381E-3},{"$f":"IF(F$63>0.014,EXP(3.5221-0.5291*F$63),EXP(4.2534-52.7676*F$63))/1000","v":9.0191491467805744E-3},{"$f":"IF(G$63>0.014,EXP(2.8821-0.4893*G$63),EXP(3.6322-54.0678*G$63))/1000","v":5.2532661133623381E-3},{"$f":"IF(H$63>0.014,EXP(3.5221-0.5291*H$63),EXP(4.2534-52.7676*H$63))/1000","v":9.0191491467805744E-3},{"$f":"IF(I$63>0.014,EXP(2.8821-0.4893*I$63),EXP(3.6322-54.0678*I$63))/1000","v":5.2532661133623381E-3},{"$f":"IF(J$63>0.014,EXP(3.5221-0.5291*J$63),EXP(4.2534-52.7676*J$63))/1000","v":9.0191491467805744E-3},{"$f":"IF(K$63>0.014,EXP(2.8821-0.4893*K$63),EXP(3.6322-54.0678*K$63))/1000","v":1.3977515460260432E-2},{"$f":"IF(L$63>0.014,EXP(2.8821-0.4893*L$63),EXP(3.6322-54.0678*L$63))/1000","v":1.3977515460260432E-2},{"$f":"IF(M$63>0.014,EXP(2.8821-0.4893*M$63),EXP(3.6322-54.0678*M$63))/1000","v":1.3977515460260432E-2},{"$f":"IF(N$63>0.014,EXP(2.8821-0.4893*N$63),EXP(3.6322-54.0678*N$63))/1000","v":1.3977515460260432E-2}]
["TN","mg/L",{"$f":"IF(C$63>0.0145,EXP(0.9574-0.267*C$63),EXP(1.8156-59.4508*C$63))","v":1.3362938519585843},{"$f":"IF(D$63>0.0145,EXP(1.3219-0.2364*D$63),EXP(2.2217-62.2914*D$63))","v":2.0769490208808548},{"$f":"IF(E$63>0.0145,EXP(0.9574-0.267*E$63),EXP(1.8156-59.4508*E$63))","v":1.3362938519585843},{"$f":"IF(F$63>0.0145,EXP(1.3219-0.2364*F$63),EXP(2.2217-62.2914*F$63))","v":2.0769490208808548},{"$f":"IF(G$63>0.0145,EXP(0.9574-0.267*G$63),EXP(1.8156-59.4508*G$63))","v":1.3362938519585843},{"$f":"IF(H$63>0.0145,EXP(1.3219-0.2364*H$63),EXP(2.2217-62.2914*H$63))","v":2.0769490208808548},{"$f":"IF(I$63>0.0145,EXP(0.9574-0.267*I$63),EXP(1.8156-59.4508*I$63))","v":1.3362938519585843},{"$f":"IF(J$63>0.0145,EXP(1.3219-0.2364*J$63),EXP(2.2217-62.2914*J$63))","v":2.0769490208808548},{"$f":"IF(K$63>0.0145,EXP(0.9574-0.267*K$63),EXP(1.8156-59.4508*K$63))","v":2.2793720765192464},{"$f":"IF(L$63>0.0145,EXP(0.9574-0.267*L$63),EXP(1.8156-59.4508*L$63))","v":2.2793720765192464},{"$f":"IF(M$63>0.0145,EXP(0.9574-0.267*M$63),EXP(1.8156-59.4508*M$63))","v":2.2793720765192464},{"$f":"IF(N$63>0.0145,EXP(0.9574-0.267*N$63),EXP(1.8156-59.4508*N$63))","v":2.2793720765192464}]
["TOC","mg/L",{"$f":"IF(C$63>0.00608,EXP(2.724-0.1886*C$63),EXP(2.724-0.1886*C$63))","v":9.5114848498470099},{"$f":"IF(D$63>0.00608,EXP(3.1124-0.2821*D$63),EXP(3.1124-0.2821*D$63))","v":11.102274530675251},{"$f":"IF(E$63>0.00608,EXP(2.724-0.1886*E$63),EXP(2.724-0.1886*E$63))","v":9.5114848498470099},{"$f":"IF(F$63>0.00608,EXP(3.1124-0.2821*F$63),EXP(3.1124-0.2821*F$63))","v":11.102274530675251},{"$f":"IF(G$63>0.00608,EXP(2.724-0.1886*G$63),EXP(2.724-0.1886*G$63))","v":9.5114848498470099},{"$f":"IF(H$63>0.00608,EXP(3.1124-0.2821*H$63),EXP(3.1124-0.2821*H$63))","v":11.102274530675251},{"$f":"IF(I$63>0.00608,EXP(2.724-0.1886*I$63),EXP(2.724-0.1886*I$63))","v":9.5114848498470099},{"$f":"IF(J$63>0.00608,EXP(3.1124-0.2821*J$63),EXP(3.1124-0.2821*J$63))","v":11.102274530675251},{"$f":"IF(K$63>0.00608,EXP(2.724-0.1886*K$63),EXP(2.724-0.1886*K$63))","v":13.869608395416487},{"$f":"IF(L$63>0.00608,EXP(2.724-0.1886*L$63),EXP(2.724-0.1886*L$63))","v":13.869608395416487},{"$f":"IF(M$63>0.00608,EXP(2.724-0.1886*M$63),EXP(2.724-0.1886*M$63))","v":13.869608395416487},{"$f":"IF(N$63>0.00608,EXP(2.724-0.1886*N$63),EXP(2.724-0.1886*N$63))","v":13.869608395416487}]
["TP","mg/L",{"$f":"IF(C$63>0.00426,EXP(-0.6134-0.4693*C$63),EXP(0.0336-152.341*C$63))","v":0.16752042413770912},{"$f":"IF(D$63>0.00426,EXP(-0.2231-0.4003*D$63),EXP(0.5338-178.08*D$63))","v":0.29409571600066703},{"$f":"IF(E$63>0.00426,EXP(-0.6134-0.4693*E$63),EXP(0.0336-152.341*E$63))","v":0.16752042413770912},{"$f":"IF(F$63>0.00426,EXP(-0.2231-0.4003*F$63),EXP(0.5338-178.08*F$63))","v":0.29409571600066703},{"$f":"IF(G$63>0.00426,EXP(-0.6134-0.4693*G$63),EXP(0.0336-152.341*G$63))","v":0.16752042413770912},{"$f":"IF(H$63>0.00426,EXP(-0.2231-0.4003*H$63),EXP(0.5338-178.08*H$63))","v":0.29409571600066703},{"$f":"IF(I$63>0.00426,EXP(-0.6134-0.4693*I$63),EXP(0.0336-152.341*I$63))","v":0.16752042413770912},{"$f":"IF(J$63>0.00426,EXP(-0.2231-0.4003*J$63),EXP(0.5338-178.08*J$63))","v":0.29409571600066703},{"$f":"IF(K$63>0.00426,EXP(-0.6134-0.4693*K$63),EXP(0.0336-152.341*K$63))","v":0.42824920421712837},{"$f":"IF(L$63>0.00426,EXP(-0.6134-0.4693*L$63),EXP(0.0336-152.341*L$63))","v":0.42824920421712837},{"$f":"IF(M$63>0.00426,EXP(-0.6134-0.4693*M$63),EXP(0.0336-152.341*M$63))","v":0.42824920421712837},{"$f":"IF(N$63>0.00426,EXP(-0.6134-0.4693*N$63),EXP(0.0336-152.341*N$63))","v":0.42824920421712837}]
["TSS","mg/L",{"$f":"IF(C$63>0.00399,EXP(5.2895-0.9341*C$63),EXP(6.3181-258.741*C$63))","v":19.187326826927933},{"$f":"IF(D$63>0.00399,EXP(5.8622-0.7645*D$63),EXP(6.8265-242.449*D$63))","v":51.984728876581904},{"$f":"IF(E$63>0.00399,EXP(5.2895-0.9341*E$63),EXP(6.3181-258.741*E$63))","v":19.187326826927933},{"$f":"IF(F$63>0.00399,EXP(5.8622-0.7645*F$63),EXP(6.8265-242.449*F$63))","v":51.984728876581904},{"$f":"IF(G$63>0.00399,EXP(5.2895-0.9341*G$63),EXP(6.3181-258.741*G$63))","v":19.187326826927933},{"$f":"IF(H$63>0.00399,EXP(5.8622-0.7645*H$63),EXP(6.8265-242.449*H$63))","v":51.984728876581904},{"$f":"IF(I$63>0.00399,EXP(5.2895-0.9341*I$63),EXP(6.3181-258.741*I$63))","v":19.187326826927933},{"$f":"IF(J$63>0.00399,EXP(5.8622-0.7645*J$63),EXP(6.8265-242.449*J$63))","v":51.984728876581904},{"$f":"IF(K$63>0.00399,EXP(5.2895-0.9341*K$63),EXP(6.3181-258.741*K$63))","v":124.26917760649039},{"$f":"IF(L$63>0.00399,EXP(5.2895-0.9341*L$63),EXP(6.3181-258.741*L$63))","v":124.26917760649039},{"$f":"IF(M$63>0.00399,EXP(5.2895-0.9341*M$63),EXP(6.3181-258.741*M$63))","v":124.26917760649039},{"$f":"IF(N$63>0.00399,EXP(5.2895-0.9341*N$63),EXP(6.3181-258.741*N$63))","v":124.26917760649039}]
["Zn","mg/L",{"$f":"IF(C$63>0.0147,EXP(4.61-0.4424*C$63),EXP(5.5439-63.9761*C$63))/1000","v":3.3248179043727767E-2},{"$f":"IF(D$63>0.0147,EXP(5.1995-0.531*D$63),EXP(6.1534-65.4251*D$63))/1000","v":4.8038366801708178E-2},{"$f":"IF(E$63>0.0147,EXP(4.61-0.4424*E$63),EXP(5.5439-63.9761*E$63))/1000","v":3.3248179043727767E-2},{"$f":"IF(F$63>0.0147,EXP(5.1995-0.531*F$63),EXP(6.1534-65.4251*F$63))/1000","v":4.8038366801708178E-2},{"$f":"IF(G$63>0.0147,EXP(4.61-0.4424*G$63),EXP(5.5439-63.9761*G$63))/1000","v":3.3248179043727767E-2},{"$f":"IF(H$63>0.0147,EXP(5.1995-0.531*H$63),EXP(6.1534-65.4251*H$63))/1000","v":4.8038366801708178E-2},{"$f":"IF(I$63>0.0147,EXP(4.61-0.4424*I$63),EXP(5.5439-63.9761*I$63))/1000","v":3.3248179043727767E-2},{"$f":"IF(J$63>0.0147,EXP(5.1995-0.531*J$63),EXP(6.1534-65.4251*J$63))/1000","v":4.8038366801708178E-2},{"$f":"IF(K$63>0.0147,EXP(4.61-0.4424*K$63),EXP(5.5439-63.9761*K$63))/1000","v":8.0543708515584678E-2},{"$f":"IF(L$63>0.0147,EXP(4.61-0.4424*L$63),EXP(5.5439-63.9761*L$63))/1000","v":8.0543708515584678E-2},{"$f":"IF(M$63>0.0147,EXP(4.61-0.4424*M$63),EXP(5.5439-63.9761*M$63))/1000","v":8.0543708515584678E-2},{"$f":"IF(N$63>0.0147,EXP(4.61-0.4424*N$63),EXP(5.5439-63.9761*N$63))/1000","v":8.0543708515584678E-2}]
[null,null,"*CM-14-10, \"Offline\" uses 80th pct, \"online\" uses 90th pct regressions"]
[]
[]
["CALCULATE: RUNOFF"]
[null,null,"Drainage Area 1","Drainage Area 2","Drainage Area 3","Drainage Area 4"]
[null,"Analyze?",1,{"$f":"IF(n_DA>1,1,0)","v":0},{"$f":"IF(n_DA>2,1,0)","v":0},{"$f":"IF(n_DA>3,1,0)","v":0}]
[null,"Drainage Area (Ac)",{"$f":"DA_A","v":1},{"$f":"DA_B","v":1},{"$f":"DA_C","v":1},{"$f":"DA_D","v":1}]
["Existing","IC %",{"$f":"ICA_b","v":0},{"$f":"ICB_b","v":0},{"$f":"ICC_b","v":0},{"$f":"ICD_b","v":0}]
[null,"Rv (Runoff Coeff)",{"$f":"0.7162*C80/100+0.0644","v":6.4399999999999999E-2},{"$f":"0.7162*D80/100+0.0644","v":6.4399999999999999E-2},{"$f":"0.7162*E80/100+0.0644","v":6.4399999999999999E-2},{"$f":"0.7162*F80/100+0.0644","v":6.4399999999999999E-2}]
[null,"Sd (Dep Storage)",{"$f":"0.2181*EXP(-1.9456*C80/100)","v":0.21809999999999999},{"$f":"0.2181*EXP(-1.9456*D80/100)","v":0.21809999999999999},{"$f":"0.2181*EXP(-1.9456*E80/100)","v":0.21809999999999999},{"$f":"0.2181*EXP(-1.9456*F80/100)","v":0.21809999999999999}]
[null,"Runoff (in/yr)",{"$f":"C$78*$A$2*C81*EXP(-$A$3/$A$2*C82)","v":1.1845187709210347},{"$f":"D$78*$A$2*D81*EXP(-$A$3/$A$2*D82)","v":0},{"$f":"E$78*$A$2*E81*EXP(-$A$3/$A$2*E82)","v":0},{"$f":"F$78*$A$2*F81*EXP(-$A$3/$A$2*F82)","v":0}]
[null,"Runoff (Ac-in/yr)",{"$f":"C79*C83","v":1.1845187709210347},{"$f":"D79*D83","v":0},0,0]
["Developed","IC %",{"$f":"ICA_d","v":0},{"$f":"ICB_d","v":0},{"$f":"ICC_d","v":0},{"$f":"ICD_d","v":0}]
[null,"Rv (Runoff Coeff)",{"$f":"0.7162*C85/100+0.0644","v":6.4399999999999999E-2},{"$f":"0.7162*D85/100+0.0644","v":6.4399999999999999E-2},{"$f":"0.7162*E85/100+0.0644","v":6.4399999999999999E-2},{"$f":"0.7162*F85/100+0.0644","v":6.4399999999999999E-2}]
[null,"Sd (Dep Storage)",{"$f":"0.2181*EXP(-1.9456*C85/100)","v":0.21809999999999999},{"$f":"0.2181*EXP(-1.9456*D85/100)","v":0.21809999999999999},{"$f":"0.2181*EXP(-1.9456*E85/100)","v":0.21809999999999999},{"$f":"0.2181*EXP(-1.9456*F85/100)","v":0.21809999999999999}]
[null,"Runoff (in/yr)",{"$f":"C$78*$A$2*C86*EXP(-$A$3/$A$2*C87)","v":1.1845187709210347},{"$f":"D$78*$A$2*D86*EXP(-$A$3/$A$2*D87)","v":0},{"$f":"E$78*$A$2*E86*EXP(-$A$3/$A$2*E87)","v":0},{"$f":"F$78*$A$2*F86*EXP(-$A$3/$A$2*F87)","v":0}]
[null,"Runoff (Ac-in/yr)",{"$f":"C79*C88","v":1.1845187709210347},{"$f":"D79*D88","v":0},0,0]
[]
["CALCULATE: '1/2\" PLUS' (MINIMUM) WATER QUALITY VOLUME"]
[null,null,"Drainage Area A","Drainage Area B","Drainage Area C","Drainage Area D"]
[null," WQV (in)",{"$f":"MAX(0.5,0.5+(ICA_d-20)/100)","v":0.5},{"$f":"MAX(0.5,0.5+(ICB_d-20)/100)","v":0.5},{"$f":"MAX(0.5,0.5+(ICC_d-20)/100)","v":0.5},{"$f":"MAX(0.5,0.5+(ICD_d-20)/100)","v":0.5}]
[]
[]
["CALCULATE: Effluent Concentrations For Each SCM"]
[null,null,"SCM A.1","SCM B.1","SCM C.1","SCM D.1"]
["Pollutant","Units",{"$f":"'1. ENTER DATA'!E63","v":"Retention Basin"},{"$f":"'1. ENTER DATA'!F63","v":"Retention Basin"},{"$f":"'1. ENTER DATA'!G63","v":"Retention Basin"},{"$f":"'1. ENTER DATA'!H63","v":"Retention Basin"}]
["COD","mg/L",{"$f":"IF(C$98=\"None\",I37,MIN(IF(C$98=\"Alternative\",'1. ENTER DATA'!E64,LOOKUP(C$98,$C$48:$G$48,$C49:$G49)),I37))","v":38.9},{"$f":"IF(D$98=\"None\",J37,MIN(IF(D$98=\"Alternative\",'1. ENTER DATA'!F64,LOOKUP(D$98,$C$48:$G$48,$C49:$G49)),J37))","v":38.9},{"$f":"IF(E$98=\"None\",K37,MIN(IF(E$98=\"Alternative\",'1. ENTER DATA'!G64,LOOKUP(E$98,$C$48:$G$48,$C49:$G49)),K37))","v":38.9},{"$f":"IF(F$98=\"None\",L37,MIN(IF(F$98=\"Alternative\",'1. ENTER DATA'!H64,LOOKUP(F$98,$C$48:$G$48,$C49:$G49)),L37))","v":38.9}]
["E. coli","CFU/100mL",{"$f":"IF(C$98=\"None\",I38,MIN(IF(C$98=\"Alternative\",'1. ENTER DATA'!E65,LOOKUP(C$98,$C$48:$G$48,$C50:$G50)),I38))","v":11065},{"$f":"IF(D$98=\"None\",J38,MIN(IF(D$98=\"Alternative\",'1. ENTER DATA'!F65,LOOKUP(D$98,$C$48:$G$48,$C50:$G50)),J38))","v":11065},{"$f":"IF(E$98=\"None\",K38,MIN(IF(E$98=\"Alternative\",'1. ENTER DATA'!G65,LOOKUP(E$98,$C$48:$G$48,$C50:$G50)),K38))","v":11065},{"$f":"IF(F$98=\"None\",L38,MIN(IF(F$98=\"Alternative\",'1. ENTER DATA'!H65,LOOKUP(F$98,$C$48:$G$48,$C50:$G50)),L38))","v":11065}]
["Pb","mg/L",{"$f":"IF(C$98=\"None\",I39,MIN(IF(C$98=\"Alternative\",'1. ENTER DATA'!E66,LOOKUP(C$98,$C$48:$G$48,$C51:$G51)),I39))","v":4.2830000000000003E-3},{"$f":"IF(D$98=\"None\",J39,MIN(IF(D$98=\"Alternative\",'1. ENTER DATA'!F66,LOOKUP(D$98,$C$48:$G$48,$C51:$G51)),J39))","v":4.2830000000000003E-3},{"$f":"IF(E$98=\"None\",K39,MIN(IF(E$98=\"Alternative\",'1. ENTER DATA'!G66,LOOKUP(E$98,$C$48:$G$48,$C51:$G51)),K39))","v":4.2830000000000003E-3},{"$f":"IF(F$98=\"None\",L39,MIN(IF(F$98=\"Alternative\",'1. ENTER DATA'!H66,LOOKUP(F$98,$C$48:$G$48,$C51:$G51)),L39))","v":4.2830000000000003E-3}]
["TN","mg/L",{"$f":"IF(C$98=\"None\",I40,MIN(IF(C$98=\"Alternative\",'1. ENTER DATA'!E67,LOOKUP(C$98,$C$48:$G$48,$C52:$G52)),I40))","v":1.42},{"$f":"IF(D$98=\"None\",J40,MIN(IF(D$98=\"Alternative\",'1. ENTER DATA'!F67,LOOKUP(D$98,$C$48:$G$48,$C52:$G52)),J40))","v":1.42},{"$f":"IF(E$98=\"None\",K40,MIN(IF(E$98=\"Alternative\",'1. ENTER DATA'!G67,LOOKUP(E$98,$C$48:$G$48,$C52:$G52)),K40))","v":1.42},{"$f":"IF(F$98=\"None\",L40,MIN(IF(F$98=\"Alternative\",'1. ENTER DATA'!H67,LOOKUP(F$98,$C$48:$G$48,$C52:$G52)),L40))","v":1.42}]
["TOC","mg/L",{"$f":"IF(C$98=\"None\",I41,MIN(IF(C$98=\"Alternative\",'1. ENTER DATA'!E68,LOOKUP(C$98,$C$48:$G$48,$C53:$G53)),I41))","v":11.45},{"$f":"IF(D$98=\"None\",J41,MIN(IF(D$98=\"Alternative\",'1. ENTER DATA'!F68,LOOKUP(D$98,$C$48:$G$48,$C53:$G53)),J41))","v":11.45},{"$f":"IF(E$98=\"None\",K41,MIN(IF(E$98=\"Alternative\",'1. ENTER DATA'!G68,LOOKUP(E$98,$C$48:$G$48,$C53:$G53)),K41))","v":11.45},{"$f":"IF(F$98=\"None\",L41,MIN(IF(F$98=\"Alternative\",'1. ENTER DATA'!H68,LOOKUP(F$98,$C$48:$G$48,$C53:$G53)),L41))","v":11.45}]
["TP","mg/L",{"$f":"IF(C$98=\"None\",I42,MIN(IF(C$98=\"Alternative\",'1. ENTER DATA'!E69,LOOKUP(C$98,$C$48:$G$48,$C54:$G54)),I42))","v":0.224},{"$f":"IF(D$98=\"None\",J42,MIN(IF(D$98=\"Alternative\",'1. ENTER DATA'!F69,LOOKUP(D$98,$C$48:$G$48,$C54:$G54)),J42))","v":0.224},{"$f":"IF(E$98=\"None\",K42,MIN(IF(E$98=\"Alternative\",'1. ENTER DATA'!G69,LOOKUP(E$98,$C$48:$G$48,$C54:$G54)),K42))","v":0.224},{"$f":"IF(F$98=\"None\",L42,MIN(IF(F$98=\"Alternative\",'1. ENTER DATA'!H69,LOOKUP(F$98,$C$48:$G$48,$C54:$G54)),L42))","v":0.224}]
["TSS","mg/L",{"$f":"IF(C$98=\"None\",I43,MIN(IF(C$98=\"Alternative\",'1. ENTER DATA'!E70,LOOKUP(C$98,$C$48:$G$48,$C55:$G55)),I43))","v":133.80000000000001},{"$f":"IF(D$98=\"None\",J43,MIN(IF(D$98=\"Alternative\",'1. ENTER DATA'!F70,LOOKUP(D$98,$C$48:$G$48,$C55:$G55)),J43))","v":133.80000000000001},{"$f":"IF(E$98=\"None\",K43,MIN(IF(E$98=\"Alternative\",'1. ENTER DATA'!G70,LOOKUP(E$98,$C$48:$G$48,$C55:$G55)),K43))","v":133.80000000000001},{"$f":"IF(F$98=\"None\",L43,MIN(IF(F$98=\"Alternative\",'1. ENTER DATA'!H70,LOOKUP(F$98,$C$48:$G$48,$C55:$G55)),L43))","v":133.80000000000001}]
["Zn","mg/L",{"$f":"IF(C$98=\"None\",I44,MIN(IF(C$98=\"Alternative\",'1. ENTER DATA'!E71,LOOKUP(C$98,$C$48:$G$48,$C56:$G56)),I44))","v":2.3565000000000003E-2},{"$f":"IF(D$98=\"None\",J44,MIN(IF(D$98=\"Alternative\",'1. ENTER DATA'!F71,LOOKUP(D$98,$C$48:$G$48,$C56:$G56)),J44))","v":2.3565000000000003E-2},{"$f":"IF(E$98=\"None\",K44,MIN(IF(E$98=\"Alternative\",'1. ENTER DATA'!G71,LOOKUP(E$98,$C$48:$G$48,$C56:$G56)),K44))","v":2.3565000000000003E-2},{"$f":"IF(F$98=\"None\",L44,MIN(IF(F$98=\"Alternative\",'1. ENTER DATA'!H71,LOOKUP(F$98,$C$48:$G$48,$C56:$G56)),L44))","v":2.3565000000000003E-2}]
[null,null,"SCM A.2","SCM B.2","SCM C.2","SCM D.2"]
["Pollutant","Units",{"$f":"'1. ENTER DATA'!E73","v":"Infiltration Field"},{"$f":"'1. ENTER DATA'!F73","v":"Infiltration Field"},{"$f":"'1. ENTER DATA'!G73","v":"Infiltration Field"},{"$f":"'1. ENTER DATA'!H73","v":"Infiltration Field"}]
["COD","mg/L",{"$f":"MIN(IF(C$108=\"Alternative\",'1. ENTER DATA'!E74,IF(OR(C$108=\"Infiltration Field\",C$108=\"None\",C$108=\"Beneficial Reuse\"),C99,LOOKUP(C$108,$C$48:$G$48,$C49:$G49))),C99)","v":38.9},{"$f":"MIN(IF(D$108=\"Alternative\",'1. ENTER DATA'!F74,IF(OR(D$108=\"Infiltration Field\",D$108=\"None\",D$108=\"Beneficial Reuse\"),D99,LOOKUP(D$108,$C$48:$G$48,$C49:$G49))),D99)","v":38.9},{"$f":"MIN(IF(E$108=\"Alternative\",'1. ENTER DATA'!G74,IF(OR(E$108=\"Infiltration Field\",E$108=\"None\",E$108=\"Beneficial Reuse\"),E99,LOOKUP(E$108,$C$48:$G$48,$C49:$G49))),E99)","v":38.9},{"$f":"MIN(IF(F$108=\"Alternative\",'1. ENTER DATA'!H74,IF(OR(F$108=\"Infiltration Field\",F$108=\"None\",F$108=\"Beneficial Reuse\"),F99,LOOKUP(F$108,$C$48:$G$48,$C49:$G49))),F99)","v":38.9}]
["E. coli","CFU/100mL",{"$f":"MIN(IF(C$108=\"Alternative\",'1. ENTER DATA'!E75,IF(OR(C$108=\"Infiltration Field\",C$108=\"None\",C$108=\"Beneficial Reuse\"),C100,LOOKUP(C$108,$C$48:$G$48,$C50:$G50))),C100)","v":11065},{"$f":"MIN(IF(D$108=\"Alternative\",'1. ENTER DATA'!F75,IF(OR(D$108=\"Infiltration Field\",D$108=\"None\",D$108=\"Beneficial Reuse\"),D100,LOOKUP(D$108,$C$48:$G$48,$C50:$G50))),D100)","v":11065},{"$f":"MIN(IF(E$108=\"Alternative\",'1. ENTER DATA'!G75,IF(OR(E$108=\"Infiltration Field\",E$108=\"None\",E$108=\"Beneficial Reuse\"),E100,LOOKUP(E$108,$C$48:$G$48,$C50:$G50))),E100)","v":11065},{"$f":"MIN(IF(F$108=\"Alternative\",'1. ENTER DATA'!H75,IF(OR(F$108=\"Infiltration Field\",F$108=\"None\",F$108=\"Beneficial Reuse\"),F100,LOOKUP(F$108,$C$48:$G$48,$C50:$G50))),F100)","v":11065}]
["Pb","mg/L",{"$f":"MIN(IF(C$108=\"Alternative\",'1. ENTER DATA'!E76,IF(OR(C$108=\"Infiltration Field\",C$108=\"None\",C$108=\"Beneficial Reuse\"),C101,LOOKUP(C$108,$C$48:$G$48,$C51:$G51))),C101)","v":4.2830000000000003E-3},{"$f":"MIN(IF(D$108=\"Alternative\",'1. ENTER DATA'!F76,IF(OR(D$108=\"Infiltration Field\",D$108=\"None\",D$108=\"Beneficial Reuse\"),D101,LOOKUP(D$108,$C$48:$G$48,$C51:$G51))),D101)","v":4.2830000000000003E-3},{"$f":"MIN(IF(E$108=\"Alternative\",'1. ENTER DATA'!G76,IF(OR(E$108=\"Infiltration Field\",E$108=\"None\",E$108=\"Beneficial Reuse\"),E101,LOOKUP(E$108,$C$48:$G$48,$C51:$G51))),E101)","v":4.2830000000000003E-3},{"$f":"MIN(IF(F$108=\"Alternative\",'1. ENTER DATA'!H76,IF(OR(F$108=\"Infiltration Field\",F$108=\"None\",F$108=\"Beneficial Reuse\"),F101,LOOKUP(F$108,$C$48:$G$48,$C51:$G51))),F101)","v":4.2830000000000003E-3}]
["TN","mg/L",{"$f":"MIN(IF(C$108=\"Alternative\",'1. ENTER DATA'!E77,IF(OR(C$108=\"Infiltration Field\",C$108=\"None\",C$108=\"Beneficial Reuse\"),C102,LOOKUP(C$108,$C$48:$G$48,$C52:$G52))),C102)","v":1.42},{"$f":"MIN(IF(D$108=\"Alternative\",'1. ENTER DATA'!F77,IF(OR(D$108=\"Infiltration Field\",D$108=\"None\",D$108=\"Beneficial Reuse\"),D102,LOOKUP(D$108,$C$48:$G$48,$C52:$G52))),D102)","v":1.42},{"$f":"MIN(IF(E$108=\"Alternative\",'1. ENTER DATA'!G77,IF(OR(E$108=\"Infiltration Field\",E$108=\"None\",E$108=\"Beneficial Reuse\"),E102,LOOKUP(E$108,$C$48:$G$48,$C52:$G52))),E102)","v":1.42},{"$f":"MIN(IF(F$108=\"Alternative\",'1. ENTER DATA'!H77,IF(OR(F$108=\"Infiltration Field\",F$108=\"None\",F$108=\"Beneficial Reuse\"),F102,LOOKUP(F$108,$C$48:$G$48,$C52:$G52))),F102)","v":1.42}]
["TOC","mg/L",{"$f":"MIN(IF(C$108=\"Alternative\",'1. ENTER DATA'!E78,IF(OR(C$108=\"Infiltration Field\",C$108=\"None\",C$108=\"Beneficial Reuse\"),C103,LOOKUP(C$108,$C$48:$G$48,$C53:$G53))),C103)","v":11.45},{"$f":"MIN(IF(D$108=\"Alternative\",'1. ENTER DATA'!F78,IF(OR(D$108=\"Infiltration Field\",D$108=\"None\",D$108=\"Beneficial Reuse\"),D103,LOOKUP(D$108,$C$48:$G$48,$C53:$G53))),D103)","v":11.45},{"$f":"MIN(IF(E$108=\"Alternative\",'1. ENTER DATA'!G78,IF(OR(E$108=\"Infiltration Field\",E$108=\"None\",E$108=\"Beneficial Reuse\"),E103,LOOKUP(E$108,$C$48:$G$48,$C53:$G53))),E103)","v":11.45},{"$f":"MIN(IF(F$108=\"Alternative\",'1. ENTER DATA'!H78,IF(OR(F$108=\"Infiltration Field\",F$108=\"None\",F$108=\"Beneficial Reuse\"),F103,LOOKUP(F$108,$C$48:$G$48,$C53:$G53))),F103)","v":11.45}]
["TP","mg/L",{"$f":"MIN(IF(C$108=\"Alternative\",'1. ENTER DATA'!E79,IF(OR(C$108=\"Infiltration Field\",C$108=\"None\",C$108=\"Beneficial Reuse\"),C104,LOOKUP(C$108,$C$48:$G$48,$C54:$G54))),C104)","v":0.224},{"$f":"MIN(IF(D$108=\"Alternative\",'1. ENTER DATA'!F79,IF(OR(D$108=\"Infiltration Field\",D$108=\"None\",D$108=\"Beneficial Reuse\"),D104,LOOKUP(D$108,$C$48:$G$48,$C54:$G54))),D104)","v":0.224},{"$f":"MIN(IF(E$108=\"Alternative\",'1. ENTER DATA'!G79,IF(OR(E$108=\"Infiltration Field\",E$108=\"None\",E$108=\"Beneficial Reuse\"),E104,LOOKUP(E$108,$C$48:$G$48,$C54:$G54))),E104)","v":0.224},{"$f":"MIN(IF(F$108=\"Alternative\",'1. ENTER DATA'!H79,IF(OR(F$108=\"Infiltration Field\",F$108=\"None\",F$108=\"Beneficial Reuse\"),F104,LOOKUP(F$108,$C$48:$G$48,$C54:$G54))),F104)","v":0.224}]
["TSS","mg/L",{"$f":"MIN(IF(C$108=\"Alternative\",'1. ENTER DATA'!E80,IF(OR(C$108=\"Infiltration Field\",C$108=\"None\",C$108=\"Beneficial Reuse\"),C105,LOOKUP(C$108,$C$48:$G$48,$C55:$G55))),C105)","v":133.80000000000001},{"$f":"MIN(IF(D$108=\"Alternative\",'1. ENTER DATA'!F80,IF(OR(D$108=\"Infiltration Field\",D$108=\"None\",D$108=\"Beneficial Reuse\"),D105,LOOKUP(D$108,$C$48:$G$48,$C55:$G55))),D105)","v":133.80000000000001},{"$f":"MIN(IF(E$108=\"Alternative\",'1. ENTER DATA'!G80,IF(OR(E$108=\"Infiltration Field\",E$108=\"None\",E$108=\"Beneficial Reuse\"),E105,LOOKUP(E$108,$C$48:$G$48,$C55:$G55))),E105)","v":133.80000000000001},{"$f":"MIN(IF(F$108=\"Alternative\",'1. ENTER DATA'!H80,IF(OR(F$108=\"Infiltration Field\",F$108=\"None\",F$108=\"Beneficial Reuse\"),F105,LOOKUP(F$108,$C$48:$G$48,$C55:$G55))),F105)","v":133.80000000000001}]
["Zn","mg/L",{"$f":"MIN(IF(C$108=\"Alternative\",'1. ENTER DATA'!E81,IF(OR(C$108=\"Infiltration Field\",C$108=\"None\",C$108=\"Beneficial Reuse\"),C106,LOOKUP(C$108,$C$48:$G$48,$C56:$G56))),C106)","v":2.3565000000000003E-2},{"$f":"MIN(IF(D$108=\"Alternative\",'1. ENTER DATA'!F81,IF(OR(D$108=\"Infiltration Field\",D$108=\"None\",D$108=\"Beneficial Reuse\"),D106,LOOKUP(D$108,$C$48:$G$48,$C56:$G56))),D106)","v":2.3565000000000003E-2},{"$f":"MIN(IF(E$108=\"Alternative\",'1. ENTER DATA'!G81,IF(OR(E$108=\"Infiltration Field\",E$108=\"None\",E$108=\"Beneficial Reuse\"),E106,LOOKUP(E$108,$C$48:$G$48,$C56:$G56))),E106)","v":2.3565000000000003E-2},{"$f":"MIN(IF(F$108=\"Alternative\",'1. ENTER DATA'!H81,IF(OR(F$108=\"Infiltration Field\",F$108=\"None\",F$108=\"Beneficial Reuse\"),F106,LOOKUP(F$108,$C$48:$G$48,$C56:$G56))),F106)","v":2.3565000000000003E-2}]
[]
["CALCULATE: Bypass Concentrations For Each SCM"]
[null,null,"Drainage Area A","Drainage Area B","Drainage Area C","Drainage Area D"]
[null,null,"SCM A.1","SCM B.1","SCM C.1","SCM D.1"]
["Pollutant","Units",{"$f":"'1. ENTER DATA'!E63","v":"Retention Basin"},{"$f":"'1. ENTER DATA'!F63","v":"Retention Basin"},{"$f":"'1. ENTER DATA'!G63","v":"Retention Basin"},{"$f":"'1. ENTER DATA'!H63","v":"Retention Basin"}]
["COD","mg/L",{"$f":"IF(C$121=\"None\",I37,MIN(I37,IF('1. ENTER DATA'!E$27=\"Yes (Off-Line)\",C65,D65)))","v":24.953148334792502},{"$f":"IF(D$121=\"None\",J37,MIN(J37,IF('1. ENTER DATA'!F$27=\"Yes (Off-Line)\",E65,F65)))","v":24.953148334792502},{"$f":"IF(E$121=\"None\",K37,MIN(K37,IF('1. ENTER DATA'!G$27=\"Yes (Off-Line)\",G65,H65)))","v":24.953148334792502},{"$f":"IF(F$121=\"None\",L37,MIN(L37,IF('1. ENTER DATA'!H$27=\"Yes (Off-Line)\",I65,J65)))","v":24.953148334792502}]
["E. coli","CFU/100mL",{"$f":"IF(C$121=\"None\",I38,MIN(I38,IF('1. ENTER DATA'!E$27=\"Yes (Off-Line)\",C66,D66)))","v":8229.24868738228},{"$f":"IF(D$121=\"None\",J38,MIN(J38,IF('1. ENTER DATA'!F$27=\"Yes (Off-Line)\",E66,F66)))","v":8229.24868738228},{"$f":"IF(E$121=\"None\",K38,MIN(K38,IF('1. ENTER DATA'!G$27=\"Yes (Off-Line)\",G66,H66)))","v":8229.24868738228},{"$f":"IF(F$121=\"None\",L38,MIN(L38,IF('1. ENTER DATA'!H$27=\"Yes (Off-Line)\",I66,J66)))","v":8229.24868738228}]
["Pb","mg/L",{"$f":"IF(C$121=\"None\",I39,MIN(I39,IF('1. ENTER DATA'!E$27=\"Yes (Off-Line)\",C67,D67)))","v":4.2830000000000003E-3},{"$f":"IF(D$121=\"None\",J39,MIN(J39,IF('1. ENTER DATA'!F$27=\"Yes (Off-Line)\",E67,F67)))","v":4.2830000000000003E-3},{"$f":"IF(E$121=\"None\",K39,MIN(K39,IF('1. ENTER DATA'!G$27=\"Yes (Off-Line)\",G67,H67)))","v":4.2830000000000003E-3},{"$f":"IF(F$121=\"None\",L39,MIN(L39,IF('1. ENTER DATA'!H$27=\"Yes (Off-Line)\",I67,J67)))","v":4.2830000000000003E-3}]
["TN","mg/L",{"$f":"IF(C$121=\"None\",I40,MIN(I40,IF('1. ENTER DATA'!E$27=\"Yes (Off-Line)\",C68,D68)))","v":1.3362938519585843},{"$f":"IF(D$121=\"None\",J40,MIN(J40,IF('1. ENTER DATA'!F$27=\"Yes (Off-Line)\",E68,F68)))","v":1.3362938519585843},{"$f":"IF(E$121=\"None\",K40,MIN(K40,IF('1. ENTER DATA'!G$27=\"Yes (Off-Line)\",G68,H68)))","v":1.3362938519585843},{"$f":"IF(F$121=\"None\",L40,MIN(L40,IF('1. ENTER DATA'!H$27=\"Yes (Off-Line)\",I68,J68)))","v":1.3362938519585843}]
["TOC","mg/L",{"$f":"IF(C$121=\"None\",I41,MIN(I41,IF('1. ENTER DATA'!E$27=\"Yes (Off-Line)\",C69,D69)))","v":9.5114848498470099},{"$f":"IF(D$121=\"None\",J41,MIN(J41,IF('1. ENTER DATA'!F$27=\"Yes (Off-Line)\",E69,F69)))","v":9.5114848498470099},{"$f":"IF(E$121=\"None\",K41,MIN(K41,IF('1. ENTER DATA'!G$27=\"Yes (Off-Line)\",G69,H69)))","v":9.5114848498470099},{"$f":"IF(F$121=\"None\",L41,MIN(L41,IF('1. ENTER DATA'!H$27=\"Yes (Off-Line)\",I69,J69)))","v":9.5114848498470099}]
["TP","mg/L",{"$f":"IF(C$121=\"None\",I42,MIN(I42,IF('1. ENTER DATA'!E$27=\"Yes (Off-Line)\",C70,D70)))","v":0.16752042413770912},{"$f":"IF(D$121=\"None\",J42,MIN(J42,IF('1. ENTER DATA'!F$27=\"Yes (Off-Line)\",E70,F70)))","v":0.16752042413770912},{"$f":"IF(E$121=\"None\",K42,MIN(K42,IF('1. ENTER DATA'!G$27=\"Yes (Off-Line)\",G70,H70)))","v":0.16752042413770912},{"$f":"IF(F$121=\"None\",L42,MIN(L42,IF('1. ENTER DATA'!H$27=\"Yes (Off-Line)\",I70,J70)))","v":0.16752042413770912}]
["TSS","mg/L",{"$f":"IF(C$121=\"None\",I43,MIN(I43,IF('1. ENTER DATA'!E$27=\"Yes (Off-Line)\",C71,D71)))","v":19.187326826927933},{"$f":"IF(D$121=\"None\",J43,MIN(J43,IF('1. ENTER DATA'!F$27=\"Yes (Off-Line)\",E71,F71)))","v":19.187326826927933},{"$f":"IF(E$121=\"None\",K43,MIN(K43,IF('1. ENTER DATA'!G$27=\"Yes (Off-Line)\",G71,H71)))","v":19.187326826927933},{"$f":"IF(F$121=\"None\",L43,MIN(L43,IF('1. ENTER DATA'!H$27=\"Yes (Off-Line)\",I71,J71)))","v":19.187326826927933}]
["Zn","mg/L",{"$f":"IF(C$121=\"None\",I44,MIN(I44,IF('1. ENTER DATA'!E$27=\"Yes (Off-Line)\",C72,D72)))","v":2.3565000000000003E-2},{"$f":"IF(D$121=\"None\",J44,MIN(J44,IF('1. ENTER DATA'!F$27=\"Yes (Off-Line)\",E72,F72)))","v":2.3565000000000003E-2},{"$f":"IF(E$121=\"None\",K44,MIN(K44,IF('1. ENTER DATA'!G$27=\"Yes (Off-Line)\",G72,H72)))","v":2.3565000000000003E-2},{"$f":"IF(F$121=\"None\",L44,MIN(L44,IF('1. ENTER DATA'!H$27=\"Yes (Off-Line)\",I72,J72)))","v":2.3565000000000003E-2}]
[null,null,"SCM A.2","SCM B.2","SCM C.2","SCM D.2"]
["Pollutant","Units",{"$f":"'1. ENTER DATA'!E73","v":"Infiltration Field"},{"$f":"'1. ENTER DATA'!F73","v":"Infiltration Field"},{"$f":"'1. ENTER DATA'!G73","v":"Infiltration Field"},{"$f":"'1. ENTER DATA'!H73","v":"Infiltration Field"}]
["COD","mg/L",{"$f":"C99","v":38.9},38.9,38.9,38.9]
["E. coli","CFU/100mL",11065,11065,11065,11065]
["Pb","mg/L",4.2830000000000003E-3,4.2830000000000003E-3,4.2830000000000003E-3,4.2830000000000003E-3]
["TN","mg/L",1.42,1.42,1.42,1.42]
["TOC","mg/L",11.45,11.45,11.45,11.45]
["TP","mg/L",0.224,0.224,0.224,0.224]
["TSS","mg/L",133.80000000000001,133.80000000000001,133.80000000000001,133.80000000000001]
["Zn","mg/L",2.3565000000000003E-2,2.3565000000000003E-2,2.3565000000000003E-2,2.3565000000000003E-2]
[]
["CALCULATE: SCM Volumes"]
[null,null,"SCM A.1","SCM B.1","SCM C.1","SCM D.1"]
["Control is not \"None\"? ",null,{"$f":"IF('1. ENTER DATA'!E26<>\"None\",1,0)","v":1},{"$f":"IF('1. ENTER DATA'!F26<>\"None\",1,0)","v":1},{"$f":"IF('1. ENTER DATA'!G26<>\"None\",1,0)","v":1},{"$f":"IF('1. ENTER DATA'!H26<>\"None\",1,0)","v":1}]
["Volume treated by SCM 1 (in/yr)",null,{"$f":"RCE_A1/100*'3. CALCS_Loads'!C88*C143","v":1.1839627863340729},{"$f":"RCE_B1/100*'3. CALCS_Loads'!D88*D143","v":0},{"$f":"RCE_C1/100*'3. CALCS_Loads'!E88*E143","v":0},{"$f":"RCE_D1/100*'3. CALCS_Loads'!F88*F143","v":0}]
["Volume treated by SCM 1 (Ac-in/yr)",null,{"$f":"RCE_A1/100*'3. CALCS_Loads'!C89","v":1.1839627863340729},{"$f":"RCE_B1/100*'3. CALCS_Loads'!D89","v":0},{"$f":"RCE_C1/100*'3. CALCS_Loads'!E89","v":0},{"$f":"RCE_D1/100*'3. CALCS_Loads'!F89","v":0}]
["Bypass Volume (in/yr)",null,{"$f":"'3. CALCS_Loads'!C88-C144","v":5.5598458696182185E-4},{"$f":"'3. CALCS_Loads'!D88-D144","v":0},{"$f":"'3. CALCS_Loads'!E88-E144","v":0},{"$f":"'3. CALCS_Loads'!F88-F144","v":0}]
["Bypass Volume (Ac-in/yr)",null,{"$f":"'3. CALCS_Loads'!C89-C145","v":5.5598458696182185E-4},{"$f":"'3. CALCS_Loads'!D89-D145","v":0},{"$f":"'3. CALCS_Loads'!E89-E145","v":0},{"$f":"'3. CALCS_Loads'!F89-F145","v":0}]
[null,null,"SCM A.2","SCM B.2","SCM C.2","SCM D.2"]
["Control is not \"None\"?",null,{"$f":"IF('1. ENTER DATA'!E42<>\"None\",1,0)","v":1},{"$f":"IF('1. ENTER DATA'!F42<>\"None\",1,0)","v":1},{"$f":"IF('1. ENTER DATA'!G42<>\"None\",1,0)","v":1},{"$f":"IF('1. ENTER DATA'!H42<>\"None\",1,0)","v":1}]
["Volume routed to SCM 2 (in/yr)",null,{"$f":"'5.CALCS_Adams&Papa'!B53*C78*C149","v":1.1839627863340727},{"$f":"'5.CALCS_Adams&Papa'!C53*D78*D149","v":0},{"$f":"'5.CALCS_Adams&Papa'!D53*E78*E149","v":0},{"$f":"'5.CALCS_Adams&Papa'!E53*F78*F149","v":0}]
["Volume routed to SCM 2 (Ac-in/yr)",null,{"$f":"C79*C150","v":1.1839627863340727},{"$f":"D79*D150","v":0},{"$f":"E79*E150","v":0},{"$f":"F79*F150","v":0}]
["Infiltrated Volume (in/yr)",null,{"$f":"C$78*IF('1. ENTER DATA'!E46=\"Yes\",'4. CALCS_Infiltration'!E38,0)*C149","v":1.1839627863340727},{"$f":"D$78*IF('1. ENTER DATA'!F46=\"Yes\",'4. CALCS_Infiltration'!F38,0)*D149","v":0},{"$f":"E$78*IF('1. ENTER DATA'!G46=\"Yes\",'4. CALCS_Infiltration'!G38,0)*E149","v":0},{"$f":"F$78*IF('1. ENTER DATA'!H46=\"Yes\",'4. CALCS_Infiltration'!H38,0)*F149","v":0}]
["Infiltrated Volume (Ac-in/yr) - for calcs",null,{"$f":"C79*C152","v":1.1839627863340727},{"$f":"D79*D152","v":0},{"$f":"E79*E152","v":0},{"$f":"F79*F152","v":0}]
["Non-infiltrated Volume Treated by SCM 2 (in/yr)",null,{"$f":"C150-C152","v":0},{"$f":"D150-D152","v":0},{"$f":"E150-E152","v":0},{"$f":"F150-F152","v":0}]
["Non-infiltrated Volume Treated by SCM 2 (Acre-in/yr)",null,{"$f":"C79*C154","v":0},{"$f":"D79*D154","v":0},{"$f":"E79*E154","v":0},{"$f":"F79*F154","v":0}]
["Volume treated by only SCM 1 (bypasses SCM 2) (in/yr)",null,{"$f":"'3. CALCS_Loads'!C144-'3. CALCS_Loads'!C150","v":0},{"$f":"'3. CALCS_Loads'!D144-'3. CALCS_Loads'!D150","v":0},{"$f":"'3. CALCS_Loads'!E144-'3. CALCS_Loads'!E150","v":0},{"$f":"'3. CALCS_Loads'!F144-'3. CALCS_Loads'!F150","v":0}]
["Volume treated by only SCM 1 (bypasses SCM 2) (Acre-in/yr)",null,{"$f":"'3. CALCS_Loads'!C145-'3. CALCS_Loads'!C151","v":0},{"$f":"'3. CALCS_Loads'!D145-'3. CALCS_Loads'!D151","v":0},{"$f":"'3. CALCS_Loads'!E145-'3. CALCS_Loads'!E151","v":0},{"$f":"'3. CALCS_Loads'!F145-'3. CALCS_Loads'!F151","v":0}]
[]
[null,null,null,null,null,null,null,null,null,null,null,null,null,null,{"$f":"J164","v":10.445832768807366}]
["CALCULATE: Min infiltration volumes to achieve existing load (per drainage area)"]
[null,"Loads  (lb/yr or 10^6 MPN/yr)",null,null,null,null,null,null,null,null,null,null,null,null,null,null,null,"Conc (mg/L or CFU/100 mL)",null,null,null,"Volume to inf (in/yr)"]
[null,"SCM 1 only",null,null,null,"Bypassed",null,null,null,"Existing",null,null,null,"Remaining Load to treat"]
["POLLUTANT","Drainage Area A","Drainage Area B","Drainage Area C","Drainage Area D","Drainage Area A","Drainage Area B","Drainage Area C","Drainage Area D","Drainage Area A","Drainage Area B","Drainage Area C","Drainage Area D","Drainage Area A","Drainage Area B","Drainage Area C","Drainage Area D","Drainage Area A","Drainage Area B","Drainage Area C","Drainage Area D","Drainage Area A","Drainage Area B","Drainage Area C","Drainage Area D"]
["COD",{"$f":"'3. CALCS_Loads'!B178","v":10.440929746449244},{"$f":"'3. CALCS_Loads'!C178","v":0},{"$f":"'3. CALCS_Loads'!D178","v":0},{"$f":"'3. CALCS_Loads'!E178","v":0},{"$f":"'3. CALCS_Loads'!N178","v":3.145137382800792E-3},{"$f":"'3. CALCS_Loads'!O178","v":0},{"$f":"'3. CALCS_Loads'!P178","v":0},{"$f":"'3. CALCS_Loads'!Q178","v":0},{"$f":"'3. CALCS_Loads'!R178","v":10.445832768807366},{"$f":"'3. CALCS_Loads'!S178","v":0},{"$f":"'3. CALCS_Loads'!T178","v":0},{"$f":"'3. CALCS_Loads'!U178","v":0},{"$f":"B164+F164-J164","v":-1.7578849753210335E-3},{"$f":"C164+G164-K164","v":0},{"$f":"D164+H164-L164","v":0},{"$f":"E164+I164-M164","v":0},{"$f":"C99","v":38.9},38.9,38.9,38.9,{"$f":"N164/R164/IF(LOOKUP($A164,'3. CALCS_Loads'!$A$37:$A$44,'3. CALCS_Loads'!$C$37:$C$44)=\"CF_1\",CF_1,CF_2)/DA_A","v":-1.9933764942185278E-4},{"$f":"O164/S164/IF(LOOKUP($A164,'3. CALCS_Loads'!$A$37:$A$44,'3. CALCS_Loads'!$C$37:$C$44)=\"CF_1\",CF_1,CF_2)/DA_B","v":0},{"$f":"P164/T164/IF(LOOKUP($A164,'3. CALCS_Loads'!$A$37:$A$44,'3. CALCS_Loads'!$C$37:$C$44)=\"CF_1\",CF_1,CF_2)/DA_C","v":0},{"$f":"Q164/U164/IF(LOOKUP($A164,'3. CALCS_Loads'!$A$37:$A$44,'3. CALCS_Loads'!$C$37:$C$44)=\"CF_1\",CF_1,CF_2)/DA_D","v":0}]
["E. coli",{"$f":"'3. CALCS_Loads'!B179","v":13466.053526425461},{"$f":"'3. CALCS_Loads'!C179","v":0},{"$f":"'3. CALCS_Loads'!D179","v":0},{"$f":"'3. CALCS_Loads'!E179","v":0},{"$f":"'3. CALCS_Loads'!N179","v":4.7029872910259956},{"$f":"'3. CALCS_Loads'!O179","v":0},{"$f":"'3. CALCS_Loads'!P179","v":0},{"$f":"'3. CALCS_Loads'!Q179","v":0},{"$f":"'3. CALCS_Loads'!R179","v":10193.469623240113},{"$f":"'3. CALCS_Loads'!S179","v":0},{"$f":"'3. CALCS_Loads'!T179","v":0},{"$f":"'3. CALCS_Loads'!U179","v":0},{"$f":"B165+F165-J165","v":3277.2868904763745},0,0,{"$f":"E165+I165-M165","v":0},11065,11065,11065,11065,{"$f":"N165/R165/IF(LOOKUP($A165,'3. CALCS_Loads'!$A$37:$A$44,'3. CALCS_Loads'!$C$37:$C$44)=\"CF_1\",CF_1,CF_2)/DA_A","v":0.28814572219322865},{"$f":"O165/S165/IF(LOOKUP($A165,'3. CALCS_Loads'!$A$37:$A$44,'3. CALCS_Loads'!$C$37:$C$44)=\"CF_1\",CF_1,CF_2)/DA_B","v":0},{"$f":"P165/T165/IF(LOOKUP($A165,'3. CALCS_Loads'!$A$37:$A$44,'3. CALCS_Loads'!$C$37:$C$44)=\"CF_1\",CF_1,CF_2)/DA_C","v":0},{"$f":"Q165/U165/IF(LOOKUP($A165,'3. CALCS_Loads'!$A$37:$A$44,'3. CALCS_Loads'!$C$37:$C$44)=\"CF_1\",CF_1,CF_2)/DA_D","v":0}]
["Pb",{"$f":"'3. CALCS_Loads'!B180","v":1.1495758895640649E-3},{"$f":"'3. CALCS_Loads'!C180","v":0},{"$f":"'3. CALCS_Loads'!D180","v":0},{"$f":"'3. CALCS_Loads'!E180","v":0},{"$f":"'3. CALCS_Loads'!N180","v":5.3983662621656143E-7},{"$f":"'3. CALCS_Loads'!O180","v":0},{"$f":"'3. CALCS_Loads'!P180","v":0},{"$f":"'3. CALCS_Loads'!Q180","v":0},{"$f":"'3. CALCS_Loads'!R180","v":1.1501157261902815E-3},{"$f":"'3. CALCS_Loads'!S180","v":0},{"$f":"'3. CALCS_Loads'!T180","v":0},{"$f":"'3. CALCS_Loads'!U180","v":0},0,0,0,0,4.2830000000000003E-3,4.2830000000000003E-3,4.2830000000000003E-3,4.2830000000000003E-3,{"$f":"N166/R166/IF(LOOKUP($A166,'3. CALCS_Loads'!$A$37:$A$44,'3. CALCS_Loads'!$C$37:$C$44)=\"CF_1\",CF_1,CF_2)/DA_A","v":0},{"$f":"O166/S166/IF(LOOKUP($A166,'3. CALCS_Loads'!$A$37:$A$44,'3. CALCS_Loads'!$C$37:$C$44)=\"CF_1\",CF_1,CF_2)/DA_B","v":0},{"$f":"P166/T166/IF(LOOKUP($A166,'3. CALCS_Loads'!$A$37:$A$44,'3. CALCS_Loads'!$C$37:$C$44)=\"CF_1\",CF_1,CF_2)/DA_C","v":0},{"$f":"Q166/U166/IF(LOOKUP($A166,'3. CALCS_Loads'!$A$37:$A$44,'3. CALCS_Loads'!$C$37:$C$44)=\"CF_1\",CF_1,CF_2)/DA_D","v":0}]
["TN",{"$f":"'3. CALCS_Loads'!B181","v":0.38113419639994678},{"$f":"'3. CALCS_Loads'!C181","v":0},{"$f":"'3. CALCS_Loads'!D181","v":0},{"$f":"'3. CALCS_Loads'!E181","v":0},{"$f":"'3. CALCS_Loads'!N181","v":1.6842875663676288E-4},{"$f":"'3. CALCS_Loads'!O181","v":0},{"$f":"'3. CALCS_Loads'!P181","v":0},{"$f":"'3. CALCS_Loads'!Q181","v":0},{"$f":"'3. CALCS_Loads'!R181","v":0.31955118238768027},{"$f":"'3. CALCS_Loads'!S181","v":0},{"$f":"'3. CALCS_Loads'!T181","v":0},{"$f":"'3. CALCS_Loads'!U181","v":0},6.1751442768903264E-2,0,0,0,1.42,1.42,1.42,1.42,{"$f":"N167/R167/IF(LOOKUP($A167,'3. CALCS_Loads'!$A$37:$A$44,'3. CALCS_Loads'!$C$37:$C$44)=\"CF_1\",CF_1,CF_2)/DA_A","v":0.19182589998851637},{"$f":"O167/S167/IF(LOOKUP($A167,'3. CALCS_Loads'!$A$37:$A$44,'3. CALCS_Loads'!$C$37:$C$44)=\"CF_1\",CF_1,CF_2)/DA_B","v":0},{"$f":"P167/T167/IF(LOOKUP($A167,'3. CALCS_Loads'!$A$37:$A$44,'3. CALCS_Loads'!$C$37:$C$44)=\"CF_1\",CF_1,CF_2)/DA_C","v":0},{"$f":"Q167/U167/IF(LOOKUP($A167,'3. CALCS_Loads'!$A$37:$A$44,'3. CALCS_Loads'!$C$37:$C$44)=\"CF_1\",CF_1,CF_2)/DA_D","v":0}]
["TOC",{"$f":"'3. CALCS_Loads'!B183","v":6.0122577460273295E-2},{"$f":"'3. CALCS_Loads'!C183","v":0},{"$f":"'3. CALCS_Loads'!D183","v":0},{"$f":"'3. CALCS_Loads'!E183","v":0},{"$f":"'3. CALCS_Loads'!N183","v":2.1114560025418703E-5},{"$f":"'3. CALCS_Loads'!O183","v":0},{"$f":"'3. CALCS_Loads'!P183","v":0},{"$f":"'3. CALCS_Loads'!Q183","v":0},{"$f":"'3. CALCS_Loads'!R183","v":3.329777026560702E-2},{"$f":"'3. CALCS_Loads'!S183","v":0},{"$f":"'3. CALCS_Loads'!T183","v":0},{"$f":"'3. CALCS_Loads'!U183","v":0},{"$f":"B168+F168-J168","v":2.6845921754691693E-2},{"$f":"C168+G168-K168","v":0},{"$f":"D168+H168-L168","v":0},{"$f":"E168+I168-M168","v":0},11.45,11.45,11.45,11.45,{"$f":"N168/R168/IF(LOOKUP($A168,'3. CALCS_Loads'!$A$37:$A$44,'3. CALCS_Loads'!$C$37:$C$44)=\"CF_1\",CF_1,CF_2)/DA_A","v":1.034239959113065E-2},{"$f":"O168/S168/IF(LOOKUP($A168,'3. CALCS_Loads'!$A$37:$A$44,'3. CALCS_Loads'!$C$37:$C$44)=\"CF_1\",CF_1,CF_2)/DA_B","v":0},{"$f":"P168/T168/IF(LOOKUP($A168,'3. CALCS_Loads'!$A$37:$A$44,'3. CALCS_Loads'!$C$37:$C$44)=\"CF_1\",CF_1,CF_2)/DA_C","v":0},{"$f":"Q168/U168/IF(LOOKUP($A168,'3. CALCS_Loads'!$A$37:$A$44,'3. CALCS_Loads'!$C$37:$C$44)=\"CF_1\",CF_1,CF_2)/DA_D","v":0}]
["TP",{"$f":"'3. CALCS_Loads'!B183","v":6.0122577460273295E-2},{"$f":"'3. CALCS_Loads'!C183","v":0},{"$f":"'3. CALCS_Loads'!D183","v":0},{"$f":"'3. CALCS_Loads'!E183","v":0},{"$f":"'3. CALCS_Loads'!N183","v":2.1114560025418703E-5},{"$f":"'3. CALCS_Loads'!O183","v":0},{"$f":"'3. CALCS_Loads'!P183","v":0},{"$f":"'3. CALCS_Loads'!Q183","v":0},{"$f":"'3. CALCS_Loads'!R183","v":3.329777026560702E-2},{"$f":"'3. CALCS_Loads'!S183","v":0},{"$f":"'3. CALCS_Loads'!T183","v":0},{"$f":"'3. CALCS_Loads'!U183","v":0},2.6845921754691693E-2,0,0,0,0.224,0.224,0.224,0.224,{"$f":"N169/R169/IF(LOOKUP($A169,'3. CALCS_Loads'!$A$37:$A$44,'3. CALCS_Loads'!$C$37:$C$44)=\"CF_1\",CF_1,CF_2)/DA_A","v":0.52866283624306221},{"$f":"O169/S169/IF(LOOKUP($A169,'3. CALCS_Loads'!$A$37:$A$44,'3. CALCS_Loads'!$C$37:$C$44)=\"CF_1\",CF_1,CF_2)/DA_B","v":0},{"$f":"P169/T169/IF(LOOKUP($A169,'3. CALCS_Loads'!$A$37:$A$44,'3. CALCS_Loads'!$C$37:$C$44)=\"CF_1\",CF_1,CF_2)/DA_C","v":0},{"$f":"Q169/U169/IF(LOOKUP($A169,'3. CALCS_Loads'!$A$37:$A$44,'3. CALCS_Loads'!$C$37:$C$44)=\"CF_1\",CF_1,CF_2)/DA_D","v":0}]
["TSS",{"$f":"'3. CALCS_Loads'!B184","v":35.912503857966819},{"$f":"'3. CALCS_Loads'!C184","v":0},{"$f":"'3. CALCS_Loads'!D184","v":0},{"$f":"'3. CALCS_Loads'!E184","v":0},{"$f":"'3. CALCS_Loads'!N184","v":2.4184034042407884E-3},{"$f":"'3. CALCS_Loads'!O184","v":0},{"$f":"'3. CALCS_Loads'!P184","v":0},{"$f":"'3. CALCS_Loads'!Q184","v":0},{"$f":"'3. CALCS_Loads'!R184","v":44.576047291054564},{"$f":"'3. CALCS_Loads'!S184","v":0},{"$f":"'3. CALCS_Loads'!T184","v":0},{"$f":"'3. CALCS_Loads'!U184","v":0},-8.6611250296835038,0,0,0,133.80000000000001,133.80000000000001,133.80000000000001,133.80000000000001,{"$f":"N170/R170/IF(LOOKUP($A170,'3. CALCS_Loads'!$A$37:$A$44,'3. CALCS_Loads'!$C$37:$C$44)=\"CF_1\",CF_1,CF_2)/DA_A","v":-0.28553981542161438},{"$f":"O170/S170/IF(LOOKUP($A170,'3. CALCS_Loads'!$A$37:$A$44,'3. CALCS_Loads'!$C$37:$C$44)=\"CF_1\",CF_1,CF_2)/DA_B","v":0},{"$f":"P170/T170/IF(LOOKUP($A170,'3. CALCS_Loads'!$A$37:$A$44,'3. CALCS_Loads'!$C$37:$C$44)=\"CF_1\",CF_1,CF_2)/DA_C","v":0},{"$f":"Q170/U170/IF(LOOKUP($A170,'3. CALCS_Loads'!$A$37:$A$44,'3. CALCS_Loads'!$C$37:$C$44)=\"CF_1\",CF_1,CF_2)/DA_D","v":0}]
["Zn",{"$f":"'3. CALCS_Loads'!B185","v":6.3249488296934836E-3},{"$f":"'3. CALCS_Loads'!C185","v":0},{"$f":"'3. CALCS_Loads'!D185","v":0},{"$f":"'3. CALCS_Loads'!E185","v":0},{"$f":"'3. CALCS_Loads'!N185","v":2.9701727986909343E-6},{"$f":"'3. CALCS_Loads'!O185","v":0},{"$f":"'3. CALCS_Loads'!P185","v":0},{"$f":"'3. CALCS_Loads'!Q185","v":0},{"$f":"'3. CALCS_Loads'!R185","v":6.3279190024921744E-3},{"$f":"'3. CALCS_Loads'!S185","v":0},{"$f":"'3. CALCS_Loads'!T185","v":0},{"$f":"'3. CALCS_Loads'!U185","v":0},0,0,0,0,2.3565000000000003E-2,2.3565000000000003E-2,2.3565000000000003E-2,2.3565000000000003E-2,{"$f":"N171/R171/IF(LOOKUP($A171,'3. CALCS_Loads'!$A$37:$A$44,'3. CALCS_Loads'!$C$37:$C$44)=\"CF_1\",CF_1,CF_2)/DA_A","v":0},{"$f":"O171/S171/IF(LOOKUP($A171,'3. CALCS_Loads'!$A$37:$A$44,'3. CALCS_Loads'!$C$37:$C$44)=\"CF_1\",CF_1,CF_2)/DA_B","v":0},{"$f":"P171/T171/IF(LOOKUP($A171,'3. CALCS_Loads'!$A$37:$A$44,'3. CALCS_Loads'!$C$37:$C$44)=\"CF_1\",CF_1,CF_2)/DA_C","v":0},{"$f":"Q171/U171/IF(LOOKUP($A171,'3. CALCS_Loads'!$A$37:$A$44,'3. CALCS_Loads'!$C$37:$C$44)=\"CF_1\",CF_1,CF_2)/DA_D","v":0}]
["Min Volume to Infiltrate (Most Conservative), in/yr",null,null,null,null,null,null,null,null,null,null,null,null,null,null,null,null,null,null,null,null,{"$f":"IF(MAX(V164:V171)<0,0,MAX(V164:V171))","v":0.52866283624306221},{"$f":"IF(MAX(W164:W171)<0,0,MAX(W164:W171))","v":0},{"$f":"IF(MAX(X164:X171)<0,0,MAX(X164:X171))","v":0},{"$f":"IF(MAX(Y164:Y171)<0,0,MAX(Y164:Y171))","v":0}]
[]
["CALCULATE: Developed, Existing, and Sed/Fil Loadings - For Results Table"]
[null,"POLLUTANT EFFLUENT LOADS, lb/(yr) or 10^6 MPN/(yr)",null,null,null,null,null,null,null,null,null,null,null,null,null,null,null,null,null,null,null,null,null,null,null,null,null,null,null,"Total Site EXISTING Load, L_ex","Total Site SED/FIL Load, L_sf","Total Site BYPASSED Load, L_un","Total Site  DEVELOPED, TREATED Load, L_out","Compliance Factor","Compliance Factor","BSZ COMPLIANT? Is L_out<L_base?","Non-BSZ COMPLIANT? Is L_out<L_sf?"]
[null,"SCM 1 All Effluent",null,null,null,"Bypasses SCM 2",null,null,null,"SCM 2 Effluent",null,null,null,"Bypassed",null,null,null,"Existing",null,null,null,"Sed/Fil Equivalent",null,null,null,"Developed (Treated) Load",null,null,null,null,null,null,null,"Compare to Existing","Compare to Sed/Fil"]
["POLLUTANT","SCM A1","SCM B1","SCM C1","SCM D1","SCM A1","SCM B1","SCM C1","SCM D1","SCM A2","SCM B2","SCM C2","SCM D1","Drainage Area A","Drainage Area B","Drainage Area C","Drainage Area D","Drainage Area A","Drainage Area B","Drainage Area C","Drainage Area D","Drainage Area A","Drainage Area B","Drainage Area C","Drainage Area D","Drainage Area A","Drainage Area B","Drainage Area C","Drainage Area D","lb/(yr) or 10^6 MPN/(yr)","lb/(yr) or 10^6 MPN/(yr)","lb/(yr) or 10^6 MPN/(yr)","lb/(yr) or 10^6 MPN/(yr)"]
["COD",{"$f":"'3. CALCS_Loads'!C$145*'3. CALCS_Loads'!C99*IF(LOOKUP($A178,'3. CALCS_Loads'!$A$37:$A$44,'3. CALCS_Loads'!$C$37:$C$44)=\"CF_1\",CF_1,CF_2)","v":10.440929746449244},{"$f":"'3. CALCS_Loads'!D$145*'3. CALCS_Loads'!D99*IF(LOOKUP($A178,'3. CALCS_Loads'!$A$37:$A$44,'3. CALCS_Loads'!$C$37:$C$44)=\"CF_1\",CF_1,CF_2)","v":0},{"$f":"'3. CALCS_Loads'!E$145*'3. CALCS_Loads'!E99*IF(LOOKUP($A178,'3. CALCS_Loads'!$A$37:$A$44,'3. CALCS_Loads'!$C$37:$C$44)=\"CF_1\",CF_1,CF_2)","v":0},{"$f":"'3. CALCS_Loads'!F$145*'3. CALCS_Loads'!F99*IF(LOOKUP($A178,'3. CALCS_Loads'!$A$37:$A$44,'3. CALCS_Loads'!$C$37:$C$44)=\"CF_1\",CF_1,CF_2)","v":0},{"$f":"'3. CALCS_Loads'!C$157*'3. CALCS_Loads'!C132*IF(LOOKUP($A178,'3. CALCS_Loads'!$A$37:$A$44,'3. CALCS_Loads'!$C$37:$C$44)=\"CF_1\",CF_1,CF_2)","v":0},{"$f":"'3. CALCS_Loads'!D$157*'3. CALCS_Loads'!D132*IF(LOOKUP($A178,'3. CALCS_Loads'!$A$37:$A$44,'3. CALCS_Loads'!$C$37:$C$44)=\"CF_1\",CF_1,CF_2)","v":0},{"$f":"'3. CALCS_Loads'!E$157*'3. CALCS_Loads'!E132*IF(LOOKUP($A178,'3. CALCS_Loads'!$A$37:$A$44,'3. CALCS_Loads'!$C$37:$C$44)=\"CF_1\",CF_1,CF_2)","v":0},{"$f":"'3. CALCS_Loads'!F$157*'3. CALCS_Loads'!F132*IF(LOOKUP($A178,'3. CALCS_Loads'!$A$37:$A$44,'3. CALCS_Loads'!$C$37:$C$44)=\"CF_1\",CF_1,CF_2)","v":0},{"$f":"'3. CALCS_Loads'!C$155*'3. CALCS_Loads'!C109*IF(LOOKUP($A178,'3. CALCS_Loads'!$A$37:$A$44,'3. CALCS_Loads'!$C$37:$C$44)=\"CF_1\",CF_1,CF_2)","v":0},{"$f":"'3. CALCS_Loads'!D$155*'3. CALCS_Loads'!D109*IF(LOOKUP($A178,'3. CALCS_Loads'!$A$37:$A$44,'3. CALCS_Loads'!$C$37:$C$44)=\"CF_1\",CF_1,CF_2)","v":0},{"$f":"'3. CALCS_Loads'!E$155*'3. CALCS_Loads'!E109*IF(LOOKUP($A178,'3. CALCS_Loads'!$A$37:$A$44,'3. CALCS_Loads'!$C$37:$C$44)=\"CF_1\",CF_1,CF_2)","v":0},{"$f":"'3. CALCS_Loads'!F$155*'3. CALCS_Loads'!F109*IF(LOOKUP($A178,'3. CALCS_Loads'!$A$37:$A$44,'3. CALCS_Loads'!$C$37:$C$44)=\"CF_1\",CF_1,CF_2)","v":0},{"$f":"'3. CALCS_Loads'!C$147*'3. CALCS_Loads'!C122*IF(LOOKUP($A178,'3. CALCS_Loads'!$A$37:$A$44,'3. CALCS_Loads'!$C$37:$C$44)=\"CF_1\",CF_1,CF_2)","v":3.145137382800792E-3},{"$f":"'3. CALCS_Loads'!D$147*'3. CALCS_Loads'!D122*IF(LOOKUP($A178,'3. CALCS_Loads'!$A$37:$A$44,'3. CALCS_Loads'!$C$37:$C$44)=\"CF_1\",CF_1,CF_2)","v":0},{"$f":"'3. CALCS_Loads'!E$147*'3. CALCS_Loads'!E122*IF(LOOKUP($A178,'3. CALCS_Loads'!$A$37:$A$44,'3. CALCS_Loads'!$C$37:$C$44)=\"CF_1\",CF_1,CF_2)","v":0},{"$f":"'3. CALCS_Loads'!F$147*'3. CALCS_Loads'!F122*IF(LOOKUP($A178,'3. CALCS_Loads'!$A$37:$A$44,'3. CALCS_Loads'!$C$37:$C$44)=\"CF_1\",CF_1,CF_2)","v":0},{"$f":"'3. CALCS_Loads'!E37*C$84*IF(LOOKUP($A178,'3. CALCS_Loads'!$A$37:$A$44,'3. CALCS_Loads'!$C$37:$C$44)=\"CF_1\",CF_1,CF_2)","v":10.445832768807366},{"$f":"'3. CALCS_Loads'!F37*D$84*IF(LOOKUP($A178,'3. CALCS_Loads'!$A$37:$A$44,'3. CALCS_Loads'!$C$37:$C$44)=\"CF_1\",CF_1,CF_2)","v":0},{"$f":"'3. CALCS_Loads'!G37*E$84*IF(LOOKUP($A178,'3. CALCS_Loads'!$A$37:$A$44,'3. CALCS_Loads'!$C$37:$C$44)=\"CF_1\",CF_1,CF_2)","v":0},{"$f":"'3. CALCS_Loads'!H37*F$84*IF(LOOKUP($A178,'3. CALCS_Loads'!$A$37:$A$44,'3. CALCS_Loads'!$C$37:$C$44)=\"CF_1\",CF_1,CF_2)","v":0},{"$f":"('5.CALCS_Adams&Papa'!G$39*'3. CALCS_Loads'!$F49+'5.CALCS_Adams&Papa'!G$40*'3. CALCS_Loads'!K65)*IF(LOOKUP($A178,'3. CALCS_Loads'!$A$37:$A$44,'3. CALCS_Loads'!$C$37:$C$44)=\"CF_1\",CF_1,CF_2)*C$78","v":6.1313323300232989},{"$f":"('5.CALCS_Adams&Papa'!H$39*'3. CALCS_Loads'!$F49+'5.CALCS_Adams&Papa'!H$40*'3. CALCS_Loads'!L65)*IF(LOOKUP($A178,'3. CALCS_Loads'!$A$37:$A$44,'3. CALCS_Loads'!$C$37:$C$44)=\"CF_1\",CF_1,CF_2)*D$78","v":0},{"$f":"('5.CALCS_Adams&Papa'!I$39*'3. CALCS_Loads'!$F49+'5.CALCS_Adams&Papa'!I$40*'3. CALCS_Loads'!M65)*IF(LOOKUP($A178,'3. CALCS_Loads'!$A$37:$A$44,'3. CALCS_Loads'!$C$37:$C$44)=\"CF_1\",CF_1,CF_2)*E$78","v":0},{"$f":"('5.CALCS_Adams&Papa'!J$39*'3. CALCS_Loads'!$F49+'5.CALCS_Adams&Papa'!J$40*'3. CALCS_Loads'!N65)*IF(LOOKUP($A178,'3. CALCS_Loads'!$A$37:$A$44,'3. CALCS_Loads'!$C$37:$C$44)=\"CF_1\",CF_1,CF_2)*F$78","v":0},{"$f":"F178+J178+N178","v":3.145137382800792E-3},0,0,0,{"$f":"SUM(R178:U178)","v":10.445832768807366},{"$f":"SUM(V178:Y178)","v":6.1313323300232989},{"$f":"SUM(N178:Q178)","v":3.145137382800792E-3},{"$f":"SUM(Z178:AC178)","v":3.145137382800792E-3},{"$f":"AG178/AD178","v":3.0109015263891524E-4},{"$f":"AG178/AE178","v":5.1296149246388026E-4},{"$f":"IF(AH178<=1,\"YES\",\"NO\")","v":"YES"},{"$f":"IF(AI178<=1,\"YES\",\"NO\")","v":"YES"}]
["E. coli",{"$f":"'3. CALCS_Loads'!C$145*'3. CALCS_Loads'!C100*IF(LOOKUP($A179,'3. CALCS_Loads'!$A$37:$A$44,'3. CALCS_Loads'!$C$37:$C$44)=\"CF_1\",CF_1,CF_2)","v":13466.053526425461},{"$f":"'3. CALCS_Loads'!D$145*'3. CALCS_Loads'!D100*IF(LOOKUP($A179,'3. CALCS_Loads'!$A$37:$A$44,'3. CALCS_Loads'!$C$37:$C$44)=\"CF_1\",CF_1,CF_2)","v":0},{"$f":"'3. CALCS_Loads'!E$145*'3. CALCS_Loads'!E100*IF(LOOKUP($A179,'3. CALCS_Loads'!$A$37:$A$44,'3. CALCS_Loads'!$C$37:$C$44)=\"CF_1\",CF_1,CF_2)","v":0},{"$f":"'3. CALCS_Loads'!F$145*'3. CALCS_Loads'!F100*IF(LOOKUP($A179,'3. CALCS_Loads'!$A$37:$A$44,'3. CALCS_Loads'!$C$37:$C$44)=\"CF_1\",CF_1,CF_2)","v":0},{"$f":"'3. CALCS_Loads'!C$157*'3. CALCS_Loads'!C133*IF(LOOKUP($A179,'3. CALCS_Loads'!$A$37:$A$44,'3. CALCS_Loads'!$C$37:$C$44)=\"CF_1\",CF_1,CF_2)","v":0},{"$f":"'3. CALCS_Loads'!D$157*'3. CALCS_Loads'!D133*IF(LOOKUP($A179,'3. CALCS_Loads'!$A$37:$A$44,'3. CALCS_Loads'!$C$37:$C$44)=\"CF_1\",CF_1,CF_2)","v":0},{"$f":"'3. CALCS_Loads'!E$157*'3. CALCS_Loads'!E133*IF(LOOKUP($A179,'3. CALCS_Loads'!$A$37:$A$44,'3. CALCS_Loads'!$C$37:$C$44)=\"CF_1\",CF_1,CF_2)","v":0},{"$f":"'3. CALCS_Loads'!F$157*'3. CALCS_Loads'!F133*IF(LOOKUP($A179,'3. CALCS_Loads'!$A$37:$A$44,'3. CALCS_Loads'!$C$37:$C$44)=\"CF_1\",CF_1,CF_2)","v":0},{"$f":"'3. CALCS_Loads'!C$155*'3. CALCS_Loads'!C110*IF(LOOKUP($A179,'3. CALCS_Loads'!$A$37:$A$44,'3. CALCS_Loads'!$C$37:$C$44)=\"CF_1\",CF_1,CF_2)","v":0},{"$f":"'3. CALCS_Loads'!D$155*'3. CALCS_Loads'!D110*IF(LOOKUP($A179,'3. CALCS_Loads'!$A$37:$A$44,'3. CALCS_Loads'!$C$37:$C$44)=\"CF_1\",CF_1,CF_2)","v":0},{"$f":"'3. CALCS_Loads'!E$155*'3. CALCS_Loads'!E110*IF(LOOKUP($A179,'3. CALCS_Loads'!$A$37:$A$44,'3. CALCS_Loads'!$C$37:$C$44)=\"CF_1\",CF_1,CF_2)","v":0},{"$f":"'3. CALCS_Loads'!F$155*'3. CALCS_Loads'!F110*IF(LOOKUP($A179,'3. CALCS_Loads'!$A$37:$A$44,'3. CALCS_Loads'!$C$37:$C$44)=\"CF_1\",CF_1,CF_2)","v":0},{"$f":"'3. CALCS_Loads'!C$147*'3. CALCS_Loads'!C123*IF(LOOKUP($A179,'3. CALCS_Loads'!$A$37:$A$44,'3. CALCS_Loads'!$C$37:$C$44)=\"CF_1\",CF_1,CF_2)","v":4.7029872910259956},{"$f":"'3. CALCS_Loads'!D$147*'3. CALCS_Loads'!D123*IF(LOOKUP($A179,'3. CALCS_Loads'!$A$37:$A$44,'3. CALCS_Loads'!$C$37:$C$44)=\"CF_1\",CF_1,CF_2)","v":0},{"$f":"'3. CALCS_Loads'!E$147*'3. CALCS_Loads'!E123*IF(LOOKUP($A179,'3. CALCS_Loads'!$A$37:$A$44,'3. CALCS_Loads'!$C$37:$C$44)=\"CF_1\",CF_1,CF_2)","v":0},{"$f":"'3. CALCS_Loads'!F$147*'3. CALCS_Loads'!F123*IF(LOOKUP($A179,'3. CALCS_Loads'!$A$37:$A$44,'3. CALCS_Loads'!$C$37:$C$44)=\"CF_1\",CF_1,CF_2)","v":0},{"$f":"'3. CALCS_Loads'!E38*C$84*IF(LOOKUP($A179,'3. CALCS_Loads'!$A$37:$A$44,'3. CALCS_Loads'!$C$37:$C$44)=\"CF_1\",CF_1,CF_2)","v":10193.469623240113},{"$f":"'3. CALCS_Loads'!F38*D$84*IF(LOOKUP($A179,'3. CALCS_Loads'!$A$37:$A$44,'3. CALCS_Loads'!$C$37:$C$44)=\"CF_1\",CF_1,CF_2)","v":0},{"$f":"'3. CALCS_Loads'!G38*E$84*IF(LOOKUP($A179,'3. CALCS_Loads'!$A$37:$A$44,'3. CALCS_Loads'!$C$37:$C$44)=\"CF_1\",CF_1,CF_2)","v":0},{"$f":"'3. CALCS_Loads'!H38*F$84*IF(LOOKUP($A179,'3. CALCS_Loads'!$A$37:$A$44,'3. CALCS_Loads'!$C$37:$C$44)=\"CF_1\",CF_1,CF_2)","v":0},{"$f":"('5.CALCS_Adams&Papa'!G$39*'3. CALCS_Loads'!$F50+'5.CALCS_Adams&Papa'!G$40*'3. CALCS_Loads'!K66)*IF(LOOKUP($A179,'3. CALCS_Loads'!$A$37:$A$44,'3. CALCS_Loads'!$C$37:$C$44)=\"CF_1\",CF_1,CF_2)*C$78","v":6139.4166763390258},{"$f":"('5.CALCS_Adams&Papa'!H$39*'3. CALCS_Loads'!$F50+'5.CALCS_Adams&Papa'!H$40*'3. CALCS_Loads'!L66)*IF(LOOKUP($A179,'3. CALCS_Loads'!$A$37:$A$44,'3. CALCS_Loads'!$C$37:$C$44)=\"CF_1\",CF_1,CF_2)*D$78","v":0},{"$f":"('5.CALCS_Adams&Papa'!I$39*'3. CALCS_Loads'!$F50+'5.CALCS_Adams&Papa'!I$40*'3. CALCS_Loads'!M66)*IF(LOOKUP($A179,'3. CALCS_Loads'!$A$37:$A$44,'3. CALCS_Loads'!$C$37:$C$44)=\"CF_1\",CF_1,CF_2)*E$78","v":0},{"$f":"('5.CALCS_Adams&Papa'!J$39*'3. CALCS_Loads'!$F50+'5.CALCS_Adams&Papa'!J$40*'3. CALCS_Loads'!N66)*IF(LOOKUP($A179,'3. CALCS_Loads'!$A$37:$A$44,'3. CALCS_Loads'!$C$37:$C$44)=\"CF_1\",CF_1,CF_2)*F$78","v":0},4.7029872910259956,0,0,0,10193.469623240113,6139.4166763390258,4.7029872910259956,4.7029872910259956,4.6137257134740904E-4,7.6603161814233097E-4,{"$f":"IF(AH179<=1,\"YES\",\"NO\")","v":"YES"},{"$f":"IF(AI179<=1,\"YES\",\"NO\")","v":"YES"}]
["Pb",{"$f":"'3. CALCS_Loads'!C$145*'3. CALCS_Loads'!C101*IF(LOOKUP($A180,'3. CALCS_Loads'!$A$37:$A$44,'3. CALCS_Loads'!$C$37:$C$44)=\"CF_1\",CF_1,CF_2)","v":1.1495758895640649E-3},{"$f":"'3. CALCS_Loads'!D$145*'3. CALCS_Loads'!D101*IF(LOOKUP($A180,'3. CALCS_Loads'!$A$37:$A$44,'3. CALCS_Loads'!$C$37:$C$44)=\"CF_1\",CF_1,CF_2)","v":0},{"$f":"'3. CALCS_Loads'!E$145*'3. CALCS_Loads'!E101*IF(LOOKUP($A180,'3. CALCS_Loads'!$A$37:$A$44,'3. CALCS_Loads'!$C$37:$C$44)=\"CF_1\",CF_1,CF_2)","v":0},{"$f":"'3. CALCS_Loads'!F$145*'3. CALCS_Loads'!F101*IF(LOOKUP($A180,'3. CALCS_Loads'!$A$37:$A$44,'3. CALCS_Loads'!$C$37:$C$44)=\"CF_1\",CF_1,CF_2)","v":0},{"$f":"'3. CALCS_Loads'!C$157*'3. CALCS_Loads'!C134*IF(LOOKUP($A180,'3. CALCS_Loads'!$A$37:$A$44,'3. CALCS_Loads'!$C$37:$C$44)=\"CF_1\",CF_1,CF_2)","v":0},{"$f":"'3. CALCS_Loads'!D$157*'3. CALCS_Loads'!D134*IF(LOOKUP($A180,'3. CALCS_Loads'!$A$37:$A$44,'3. CALCS_Loads'!$C$37:$C$44)=\"CF_1\",CF_1,CF_2)","v":0},{"$f":"'3. CALCS_Loads'!E$157*'3. CALCS_Loads'!E134*IF(LOOKUP($A180,'3. CALCS_Loads'!$A$37:$A$44,'3. CALCS_Loads'!$C$37:$C$44)=\"CF_1\",CF_1,CF_2)","v":0},{"$f":"'3. CALCS_Loads'!F$157*'3. CALCS_Loads'!F134*IF(LOOKUP($A180,'3. CALCS_Loads'!$A$37:$A$44,'3. CALCS_Loads'!$C$37:$C$44)=\"CF_1\",CF_1,CF_2)","v":0},{"$f":"'3. CALCS_Loads'!C$155*'3. CALCS_Loads'!C111*IF(LOOKUP($A180,'3. CALCS_Loads'!$A$37:$A$44,'3. CALCS_Loads'!$C$37:$C$44)=\"CF_1\",CF_1,CF_2)","v":0},{"$f":"'3. CALCS_Loads'!D$155*'3. CALCS_Loads'!D111*IF(LOOKUP($A180,'3. CALCS_Loads'!$A$37:$A$44,'3. CALCS_Loads'!$C$37:$C$44)=\"CF_1\",CF_1,CF_2)","v":0},{"$f":"'3. CALCS_Loads'!E$155*'3. CALCS_Loads'!E111*IF(LOOKUP($A180,'3. CALCS_Loads'!$A$37:$A$44,'3. CALCS_Loads'!$C$37:$C$44)=\"CF_1\",CF_1,CF_2)","v":0},{"$f":"'3. CALCS_Loads'!F$155*'3. CALCS_Loads'!F111*IF(LOOKUP($A180,'3. CALCS_Loads'!$A$37:$A$44,'3. CALCS_Loads'!$C$37:$C$44)=\"CF_1\",CF_1,CF_2)","v":0},{"$f":"'3. CALCS_Loads'!C$147*'3. CALCS_Loads'!C124*IF(LOOKUP($A180,'3. CALCS_Loads'!$A$37:$A$44,'3. CALCS_Loads'!$C$37:$C$44)=\"CF_1\",CF_1,CF_2)","v":5.3983662621656143E-7},{"$f":"'3. CALCS_Loads'!D$147*'3. CALCS_Loads'!D124*IF(LOOKUP($A180,'3. CALCS_Loads'!$A$37:$A$44,'3. CALCS_Loads'!$C$37:$C$44)=\"CF_1\",CF_1,CF_2)","v":0},{"$f":"'3. CALCS_Loads'!E$147*'3. CALCS_Loads'!E124*IF(LOOKUP($A180,'3. CALCS_Loads'!$A$37:$A$44,'3. CALCS_Loads'!$C$37:$C$44)=\"CF_1\",CF_1,CF_2)","v":0},{"$f":"'3. CALCS_Loads'!F$147*'3. CALCS_Loads'!F124*IF(LOOKUP($A180,'3. CALCS_Loads'!$A$37:$A$44,'3. CALCS_Loads'!$C$37:$C$44)=\"CF_1\",CF_1,CF_2)","v":0},{"$f":"'3. CALCS_Loads'!E39*C$84*IF(LOOKUP($A180,'3. CALCS_Loads'!$A$37:$A$44,'3. CALCS_Loads'!$C$37:$C$44)=\"CF_1\",CF_1,CF_2)","v":1.1501157261902815E-3},{"$f":"'3. CALCS_Loads'!F39*D$84*IF(LOOKUP($A180,'3. CALCS_Loads'!$A$37:$A$44,'3. CALCS_Loads'!$C$37:$C$44)=\"CF_1\",CF_1,CF_2)","v":0},{"$f":"'3. CALCS_Loads'!G39*E$84*IF(LOOKUP($A180,'3. CALCS_Loads'!$A$37:$A$44,'3. CALCS_Loads'!$C$37:$C$44)=\"CF_1\",CF_1,CF_2)","v":0},{"$f":"'3. CALCS_Loads'!H39*F$84*IF(LOOKUP($A180,'3. CALCS_Loads'!$A$37:$A$44,'3. CALCS_Loads'!$C$37:$C$44)=\"CF_1\",CF_1,CF_2)","v":0},{"$f":"('5.CALCS_Adams&Papa'!G$39*'3. CALCS_Loads'!$F51+'5.CALCS_Adams&Papa'!G$40*'3. CALCS_Loads'!K67)*IF(LOOKUP($A180,'3. CALCS_Loads'!$A$37:$A$44,'3. CALCS_Loads'!$C$37:$C$44)=\"CF_1\",CF_1,CF_2)*C$78","v":1.5618023643533831E-3},{"$f":"('5.CALCS_Adams&Papa'!H$39*'3. CALCS_Loads'!$F51+'5.CALCS_Adams&Papa'!H$40*'3. CALCS_Loads'!L67)*IF(LOOKUP($A180,'3. CALCS_Loads'!$A$37:$A$44,'3. CALCS_Loads'!$C$37:$C$44)=\"CF_1\",CF_1,CF_2)*D$78","v":0},{"$f":"('5.CALCS_Adams&Papa'!I$39*'3. CALCS_Loads'!$F51+'5.CALCS_Adams&Papa'!I$40*'3. CALCS_Loads'!M67)*IF(LOOKUP($A180,'3. CALCS_Loads'!$A$37:$A$44,'3. CALCS_Loads'!$C$37:$C$44)=\"CF_1\",CF_1,CF_2)*E$78","v":0},{"$f":"('5.CALCS_Adams&Papa'!J$39*'3. CALCS_Loads'!$F51+'5.CALCS_Adams&Papa'!J$40*'3. CALCS_Loads'!N67)*IF(LOOKUP($A180,'3. CALCS_Loads'!$A$37:$A$44,'3. CALCS_Loads'!$C$37:$C$44)=\"CF_1\",CF_1,CF_2)*F$78","v":0},5.3983662621656143E-7,0,0,0,1.1501157261902815E-3,1.5618023643533831E-3,5.3983662621656143E-7,5.3983662621656143E-7,4.693759192431457E-4,3.4564976884259257E-4,"YES","YES"]
["TN",{"$f":"'3. CALCS_Loads'!C$145*'3. CALCS_Loads'!C102*IF(LOOKUP($A181,'3. CALCS_Loads'!$A$37:$A$44,'3. CALCS_Loads'!$C$37:$C$44)=\"CF_1\",CF_1,CF_2)","v":0.38113419639994678},{"$f":"'3. CALCS_Loads'!D$145*'3. CALCS_Loads'!D102*IF(LOOKUP($A181,'3. CALCS_Loads'!$A$37:$A$44,'3. CALCS_Loads'!$C$37:$C$44)=\"CF_1\",CF_1,CF_2)","v":0},{"$f":"'3. CALCS_Loads'!E$145*'3. CALCS_Loads'!E102*IF(LOOKUP($A181,'3. CALCS_Loads'!$A$37:$A$44,'3. CALCS_Loads'!$C$37:$C$44)=\"CF_1\",CF_1,CF_2)","v":0},{"$f":"'3. CALCS_Loads'!F$145*'3. CALCS_Loads'!F102*IF(LOOKUP($A181,'3. CALCS_Loads'!$A$37:$A$44,'3. CALCS_Loads'!$C$37:$C$44)=\"CF_1\",CF_1,CF_2)","v":0},{"$f":"'3. CALCS_Loads'!C$157*'3. CALCS_Loads'!C135*IF(LOOKUP($A181,'3. CALCS_Loads'!$A$37:$A$44,'3. CALCS_Loads'!$C$37:$C$44)=\"CF_1\",CF_1,CF_2)","v":0},{"$f":"'3. CALCS_Loads'!D$157*'3. CALCS_Loads'!D135*IF(LOOKUP($A181,'3. CALCS_Loads'!$A$37:$A$44,'3. CALCS_Loads'!$C$37:$C$44)=\"CF_1\",CF_1,CF_2)","v":0},{"$f":"'3. CALCS_Loads'!E$157*'3. CALCS_Loads'!E135*IF(LOOKUP($A181,'3. CALCS_Loads'!$A$37:$A$44,'3. CALCS_Loads'!$C$37:$C$44)=\"CF_1\",CF_1,CF_2)","v":0},{"$f":"'3. CALCS_Loads'!F$157*'3. CALCS_Loads'!F135*IF(LOOKUP($A181,'3. CALCS_Loads'!$A$37:$A$44,'3. CALCS_Loads'!$C$37:$C$44)=\"CF_1\",CF_1,CF_2)","v":0},{"$f":"'3. CALCS_Loads'!C$155*'3. CALCS_Loads'!C112*IF(LOOKUP($A181,'3. CALCS_Loads'!$A$37:$A$44,'3. CALCS_Loads'!$C$37:$C$44)=\"CF_1\",CF_1,CF_2)","v":0},{"$f":"'3. CALCS_Loads'!D$155*'3. CALCS_Loads'!D112*IF(LOOKUP($A181,'3. CALCS_Loads'!$A$37:$A$44,'3. CALCS_Loads'!$C$37:$C$44)=\"CF_1\",CF_1,CF_2)","v":0},{"$f":"'3. CALCS_Loads'!E$155*'3. CALCS_Loads'!E112*IF(LOOKUP($A181,'3. CALCS_Loads'!$A$37:$A$44,'3. CALCS_Loads'!$C$37:$C$44)=\"CF_1\",CF_1,CF_2)","v":0},{"$f":"'3. CALCS_Loads'!F$155*'3. CALCS_Loads'!F112*IF(LOOKUP($A181,'3. CALCS_Loads'!$A$37:$A$44,'3. CALCS_Loads'!$C$37:$C$44)=\"CF_1\",CF_1,CF_2)","v":0},{"$f":"'3. CALCS_Loads'!C$147*'3. CALCS_Loads'!C125*IF(LOOKUP($A181,'3. CALCS_Loads'!$A$37:$A$44,'3. CALCS_Loads'!$C$37:$C$44)=\"CF_1\",CF_1,CF_2)","v":1.6842875663676288E-4},{"$f":"'3. CALCS_Loads'!D$147*'3. CALCS_Loads'!D125*IF(LOOKUP($A181,'3. CALCS_Loads'!$A$37:$A$44,'3. CALCS_Loads'!$C$37:$C$44)=\"CF_1\",CF_1,CF_2)","v":0},{"$f":"'3. CALCS_Loads'!E$147*'3. CALCS_Loads'!E125*IF(LOOKUP($A181,'3. CALCS_Loads'!$A$37:$A$44,'3. CALCS_Loads'!$C$37:$C$44)=\"CF_1\",CF_1,CF_2)","v":0},{"$f":"'3. CALCS_Loads'!F$147*'3. CALCS_Loads'!F125*IF(LOOKUP($A181,'3. CALCS_Loads'!$A$37:$A$44,'3. CALCS_Loads'!$C$37:$C$44)=\"CF_1\",CF_1,CF_2)","v":0},{"$f":"'3. CALCS_Loads'!E40*C$84*IF(LOOKUP($A181,'3. CALCS_Loads'!$A$37:$A$44,'3. CALCS_Loads'!$C$37:$C$44)=\"CF_1\",CF_1,CF_2)","v":0.31955118238768027},{"$f":"'3. CALCS_Loads'!F40*D$84*IF(LOOKUP($A181,'3. CALCS_Loads'!$A$37:$A$44,'3. CALCS_Loads'!$C$37:$C$44)=\"CF_1\",CF_1,CF_2)","v":0},{"$f":"'3. CALCS_Loads'!G40*E$84*IF(LOOKUP($A181,'3. CALCS_Loads'!$A$37:$A$44,'3. CALCS_Loads'!$C$37:$C$44)=\"CF_1\",CF_1,CF_2)","v":0},{"$f":"'3. CALCS_Loads'!H40*F$84*IF(LOOKUP($A181,'3. CALCS_Loads'!$A$37:$A$44,'3. CALCS_Loads'!$C$37:$C$44)=\"CF_1\",CF_1,CF_2)","v":0},{"$f":"('5.CALCS_Adams&Papa'!G$39*'3. CALCS_Loads'!$F52+'5.CALCS_Adams&Papa'!G$40*'3. CALCS_Loads'!K68)*IF(LOOKUP($A181,'3. CALCS_Loads'!$A$37:$A$44,'3. CALCS_Loads'!$C$37:$C$44)=\"CF_1\",CF_1,CF_2)*C$78","v":0.29032806832793912},{"$f":"('5.CALCS_Adams&Papa'!H$39*'3. CALCS_Loads'!$F52+'5.CALCS_Adams&Papa'!H$40*'3. CALCS_Loads'!L68)*IF(LOOKUP($A181,'3. CALCS_Loads'!$A$37:$A$44,'3. CALCS_Loads'!$C$37:$C$44)=\"CF_1\",CF_1,CF_2)*D$78","v":0},{"$f":"('5.CALCS_Adams&Papa'!I$39*'3. CALCS_Loads'!$F52+'5.CALCS_Adams&Papa'!I$40*'3. CALCS_Loads'!M68)*IF(LOOKUP($A181,'3. CALCS_Loads'!$A$37:$A$44,'3. CALCS_Loads'!$C$37:$C$44)=\"CF_1\",CF_1,CF_2)*E$78","v":0},{"$f":"('5.CALCS_Adams&Papa'!J$39*'3. CALCS_Loads'!$F52+'5.CALCS_Adams&Papa'!J$40*'3. CALCS_Loads'!N68)*IF(LOOKUP($A181,'3. CALCS_Loads'!$A$37:$A$44,'3. CALCS_Loads'!$C$37:$C$44)=\"CF_1\",CF_1,CF_2)*F$78","v":0},1.6842875663676288E-4,0,0,0,0.31955118238768027,0.29032806832793912,1.6842875663676288E-4,1.6842875663676288E-4,5.2707912196808804E-4,5.8013252940640491E-4,"YES","YES"]
["TOC",{"$f":"'3. CALCS_Loads'!C$145*'3. CALCS_Loads'!C103*IF(LOOKUP($A182,'3. CALCS_Loads'!$A$37:$A$44,'3. CALCS_Loads'!$C$37:$C$44)=\"CF_1\",CF_1,CF_2)","v":3.073229963929148},{"$f":"'3. CALCS_Loads'!D$145*'3. CALCS_Loads'!D103*IF(LOOKUP($A182,'3. CALCS_Loads'!$A$37:$A$44,'3. CALCS_Loads'!$C$37:$C$44)=\"CF_1\",CF_1,CF_2)","v":0},{"$f":"'3. CALCS_Loads'!E$145*'3. CALCS_Loads'!E103*IF(LOOKUP($A182,'3. CALCS_Loads'!$A$37:$A$44,'3. CALCS_Loads'!$C$37:$C$44)=\"CF_1\",CF_1,CF_2)","v":0},{"$f":"'3. CALCS_Loads'!F$145*'3. CALCS_Loads'!F103*IF(LOOKUP($A182,'3. CALCS_Loads'!$A$37:$A$44,'3. CALCS_Loads'!$C$37:$C$44)=\"CF_1\",CF_1,CF_2)","v":0},{"$f":"'3. CALCS_Loads'!C$157*'3. CALCS_Loads'!C136*IF(LOOKUP($A182,'3. CALCS_Loads'!$A$37:$A$44,'3. CALCS_Loads'!$C$37:$C$44)=\"CF_1\",CF_1,CF_2)","v":0},{"$f":"'3. CALCS_Loads'!D$157*'3. CALCS_Loads'!D136*IF(LOOKUP($A182,'3. CALCS_Loads'!$A$37:$A$44,'3. CALCS_Loads'!$C$37:$C$44)=\"CF_1\",CF_1,CF_2)","v":0},{"$f":"'3. CALCS_Loads'!E$157*'3. CALCS_Loads'!E136*IF(LOOKUP($A182,'3. CALCS_Loads'!$A$37:$A$44,'3. CALCS_Loads'!$C$37:$C$44)=\"CF_1\",CF_1,CF_2)","v":0},{"$f":"'3. CALCS_Loads'!F$157*'3. CALCS_Loads'!F136*IF(LOOKUP($A182,'3. CALCS_Loads'!$A$37:$A$44,'3. CALCS_Loads'!$C$37:$C$44)=\"CF_1\",CF_1,CF_2)","v":0},{"$f":"'3. CALCS_Loads'!C$155*'3. CALCS_Loads'!C113*IF(LOOKUP($A182,'3. CALCS_Loads'!$A$37:$A$44,'3. CALCS_Loads'!$C$37:$C$44)=\"CF_1\",CF_1,CF_2)","v":0},{"$f":"'3. CALCS_Loads'!D$155*'3. CALCS_Loads'!D113*IF(LOOKUP($A182,'3. CALCS_Loads'!$A$37:$A$44,'3. CALCS_Loads'!$C$37:$C$44)=\"CF_1\",CF_1,CF_2)","v":0},{"$f":"'3. CALCS_Loads'!E$155*'3. CALCS_Loads'!E113*IF(LOOKUP($A182,'3. CALCS_Loads'!$A$37:$A$44,'3. CALCS_Loads'!$C$37:$C$44)=\"CF_1\",CF_1,CF_2)","v":0},{"$f":"'3. CALCS_Loads'!F$155*'3. CALCS_Loads'!F113*IF(LOOKUP($A182,'3. CALCS_Loads'!$A$37:$A$44,'3. CALCS_Loads'!$C$37:$C$44)=\"CF_1\",CF_1,CF_2)","v":0},{"$f":"'3. CALCS_Loads'!C$147*'3. CALCS_Loads'!C126*IF(LOOKUP($A182,'3. CALCS_Loads'!$A$37:$A$44,'3. CALCS_Loads'!$C$37:$C$44)=\"CF_1\",CF_1,CF_2)","v":1.1988437757766395E-3},{"$f":"'3. CALCS_Loads'!D$147*'3. CALCS_Loads'!D126*IF(LOOKUP($A182,'3. CALCS_Loads'!$A$37:$A$44,'3. CALCS_Loads'!$C$37:$C$44)=\"CF_1\",CF_1,CF_2)","v":0},{"$f":"'3. CALCS_Loads'!E$147*'3. CALCS_Loads'!E126*IF(LOOKUP($A182,'3. CALCS_Loads'!$A$37:$A$44,'3. CALCS_Loads'!$C$37:$C$44)=\"CF_1\",CF_1,CF_2)","v":0},{"$f":"'3. CALCS_Loads'!F$147*'3. CALCS_Loads'!F126*IF(LOOKUP($A182,'3. CALCS_Loads'!$A$37:$A$44,'3. CALCS_Loads'!$C$37:$C$44)=\"CF_1\",CF_1,CF_2)","v":0},{"$f":"'3. CALCS_Loads'!E41*C$84*IF(LOOKUP($A182,'3. CALCS_Loads'!$A$37:$A$44,'3. CALCS_Loads'!$C$37:$C$44)=\"CF_1\",CF_1,CF_2)","v":3.4989511819424157},{"$f":"'3. CALCS_Loads'!F41*D$84*IF(LOOKUP($A182,'3. CALCS_Loads'!$A$37:$A$44,'3. CALCS_Loads'!$C$37:$C$44)=\"CF_1\",CF_1,CF_2)","v":0},{"$f":"'3. CALCS_Loads'!G41*E$84*IF(LOOKUP($A182,'3. CALCS_Loads'!$A$37:$A$44,'3. CALCS_Loads'!$C$37:$C$44)=\"CF_1\",CF_1,CF_2)","v":0},{"$f":"'3. CALCS_Loads'!H41*F$84*IF(LOOKUP($A182,'3. CALCS_Loads'!$A$37:$A$44,'3. CALCS_Loads'!$C$37:$C$44)=\"CF_1\",CF_1,CF_2)","v":0},{"$f":"('5.CALCS_Adams&Papa'!G$39*'3. CALCS_Loads'!$F53+'5.CALCS_Adams&Papa'!G$40*'3. CALCS_Loads'!K69)*IF(LOOKUP($A182,'3. CALCS_Loads'!$A$37:$A$44,'3. CALCS_Loads'!$C$37:$C$44)=\"CF_1\",CF_1,CF_2)*C$78","v":1.984553085686384},{"$f":"('5.CALCS_Adams&Papa'!H$39*'3. CALCS_Loads'!$F53+'5.CALCS_Adams&Papa'!H$40*'3. CALCS_Loads'!L69)*IF(LOOKUP($A182,'3. CALCS_Loads'!$A$37:$A$44,'3. CALCS_Loads'!$C$37:$C$44)=\"CF_1\",CF_1,CF_2)*D$78","v":0},{"$f":"('5.CALCS_Adams&Papa'!I$39*'3. CALCS_Loads'!$F53+'5.CALCS_Adams&Papa'!I$40*'3. CALCS_Loads'!M69)*IF(LOOKUP($A182,'3. CALCS_Loads'!$A$37:$A$44,'3. CALCS_Loads'!$C$37:$C$44)=\"CF_1\",CF_1,CF_2)*E$78","v":0},{"$f":"('5.CALCS_Adams&Papa'!J$39*'3. CALCS_Loads'!$F53+'5.CALCS_Adams&Papa'!J$40*'3. CALCS_Loads'!N69)*IF(LOOKUP($A182,'3. CALCS_Loads'!$A$37:$A$44,'3. CALCS_Loads'!$C$37:$C$44)=\"CF_1\",CF_1,CF_2)*F$78","v":0},{"$f":"F182+J182+N182","v":1.1988437757766395E-3},{"$f":"G182+K182+O182","v":0},{"$f":"H182+L182+P182","v":0},{"$f":"I182+M182+Q182","v":0},{"$f":"SUM(R182:U182)","v":3.4989511819424157},{"$f":"SUM(V182:Y182)","v":1.984553085686384},{"$f":"SUM(N182:Q182)","v":1.1988437757766395E-3},{"$f":"SUM(Z182:AC182)","v":1.1988437757766395E-3},{"$f":"AG182/AD182","v":3.4262946621367569E-4},{"$f":"AG182/AE182","v":6.0408753206115599E-4},{"$f":"IF(AH182<=1,\"YES\",\"NO\")","v":"YES"},{"$f":"IF(AI182<=1,\"YES\",\"NO\")","v":"YES"}]
["TP",{"$f":"'3. CALCS_Loads'!C$145*'3. CALCS_Loads'!C104*IF(LOOKUP($A183,'3. CALCS_Loads'!$A$37:$A$44,'3. CALCS_Loads'!$C$37:$C$44)=\"CF_1\",CF_1,CF_2)","v":6.0122577460273295E-2},{"$f":"'3. CALCS_Loads'!D$145*'3. CALCS_Loads'!D104*IF(LOOKUP($A183,'3. CALCS_Loads'!$A$37:$A$44,'3. CALCS_Loads'!$C$37:$C$44)=\"CF_1\",CF_1,CF_2)","v":0},{"$f":"'3. CALCS_Loads'!E$145*'3. CALCS_Loads'!E104*IF(LOOKUP($A183,'3. CALCS_Loads'!$A$37:$A$44,'3. CALCS_Loads'!$C$37:$C$44)=\"CF_1\",CF_1,CF_2)","v":0},{"$f":"'3. CALCS_Loads'!F$145*'3. CALCS_Loads'!F104*IF(LOOKUP($A183,'3. CALCS_Loads'!$A$37:$A$44,'3. CALCS_Loads'!$C$37:$C$44)=\"CF_1\",CF_1,CF_2)","v":0},{"$f":"'3. CALCS_Loads'!C$157*'3. CALCS_Loads'!C137*IF(LOOKUP($A183,'3. CALCS_Loads'!$A$37:$A$44,'3. CALCS_Loads'!$C$37:$C$44)=\"CF_1\",CF_1,CF_2)","v":0},{"$f":"'3. CALCS_Loads'!D$157*'3. CALCS_Loads'!D137*IF(LOOKUP($A183,'3. CALCS_Loads'!$A$37:$A$44,'3. CALCS_Loads'!$C$37:$C$44)=\"CF_1\",CF_1,CF_2)","v":0},{"$f":"'3. CALCS_Loads'!E$157*'3. CALCS_Loads'!E137*IF(LOOKUP($A183,'3. CALCS_Loads'!$A$37:$A$44,'3. CALCS_Loads'!$C$37:$C$44)=\"CF_1\",CF_1,CF_2)","v":0},{"$f":"'3. CALCS_Loads'!F$157*'3. CALCS_Loads'!F137*IF(LOOKUP($A183,'3. CALCS_Loads'!$A$37:$A$44,'3. CALCS_Loads'!$C$37:$C$44)=\"CF_1\",CF_1,CF_2)","v":0},{"$f":"'3. CALCS_Loads'!C$155*'3. CALCS_Loads'!C114*IF(LOOKUP($A183,'3. CALCS_Loads'!$A$37:$A$44,'3. CALCS_Loads'!$C$37:$C$44)=\"CF_1\",CF_1,CF_2)","v":0},{"$f":"'3. CALCS_Loads'!D$155*'3. CALCS_Loads'!D114*IF(LOOKUP($A183,'3. CALCS_Loads'!$A$37:$A$44,'3. CALCS_Loads'!$C$37:$C$44)=\"CF_1\",CF_1,CF_2)","v":0},{"$f":"'3. CALCS_Loads'!E$155*'3. CALCS_Loads'!E114*IF(LOOKUP($A183,'3. CALCS_Loads'!$A$37:$A$44,'3. CALCS_Loads'!$C$37:$C$44)=\"CF_1\",CF_1,CF_2)","v":0},{"$f":"'3. CALCS_Loads'!F$155*'3. CALCS_Loads'!F114*IF(LOOKUP($A183,'3. CALCS_Loads'!$A$37:$A$44,'3. CALCS_Loads'!$C$37:$C$44)=\"CF_1\",CF_1,CF_2)","v":0},{"$f":"'3. CALCS_Loads'!C$147*'3. CALCS_Loads'!C127*IF(LOOKUP($A183,'3. CALCS_Loads'!$A$37:$A$44,'3. CALCS_Loads'!$C$37:$C$44)=\"CF_1\",CF_1,CF_2)","v":2.1114560025418703E-5},{"$f":"'3. CALCS_Loads'!D$147*'3. CALCS_Loads'!D127*IF(LOOKUP($A183,'3. CALCS_Loads'!$A$37:$A$44,'3. CALCS_Loads'!$C$37:$C$44)=\"CF_1\",CF_1,CF_2)","v":0},{"$f":"'3. CALCS_Loads'!E$147*'3. CALCS_Loads'!E127*IF(LOOKUP($A183,'3. CALCS_Loads'!$A$37:$A$44,'3. CALCS_Loads'!$C$37:$C$44)=\"CF_1\",CF_1,CF_2)","v":0},{"$f":"'3. CALCS_Loads'!F$147*'3. CALCS_Loads'!F127*IF(LOOKUP($A183,'3. CALCS_Loads'!$A$37:$A$44,'3. CALCS_Loads'!$C$37:$C$44)=\"CF_1\",CF_1,CF_2)","v":0},{"$f":"'3. CALCS_Loads'!E42*C$84*IF(LOOKUP($A183,'3. CALCS_Loads'!$A$37:$A$44,'3. CALCS_Loads'!$C$37:$C$44)=\"CF_1\",CF_1,CF_2)","v":3.329777026560702E-2},{"$f":"'3. CALCS_Loads'!F42*D$84*IF(LOOKUP($A183,'3. CALCS_Loads'!$A$37:$A$44,'3. CALCS_Loads'!$C$37:$C$44)=\"CF_1\",CF_1,CF_2)","v":0},{"$f":"'3. CALCS_Loads'!G42*E$84*IF(LOOKUP($A183,'3. CALCS_Loads'!$A$37:$A$44,'3. CALCS_Loads'!$C$37:$C$44)=\"CF_1\",CF_1,CF_2)","v":0},{"$f":"'3. CALCS_Loads'!H42*F$84*IF(LOOKUP($A183,'3. CALCS_Loads'!$A$37:$A$44,'3. CALCS_Loads'!$C$37:$C$44)=\"CF_1\",CF_1,CF_2)","v":0},{"$f":"('5.CALCS_Adams&Papa'!G$39*'3. CALCS_Loads'!$F54+'5.CALCS_Adams&Papa'!G$40*'3. CALCS_Loads'!K70)*IF(LOOKUP($A183,'3. CALCS_Loads'!$A$37:$A$44,'3. CALCS_Loads'!$C$37:$C$44)=\"CF_1\",CF_1,CF_2)*C$78","v":2.7401399857344279E-2},{"$f":"('5.CALCS_Adams&Papa'!H$39*'3. CALCS_Loads'!$F54+'5.CALCS_Adams&Papa'!H$40*'3. CALCS_Loads'!L70)*IF(LOOKUP($A183,'3. CALCS_Loads'!$A$37:$A$44,'3. CALCS_Loads'!$C$37:$C$44)=\"CF_1\",CF_1,CF_2)*D$78","v":0},{"$f":"('5.CALCS_Adams&Papa'!I$39*'3. CALCS_Loads'!$F54+'5.CALCS_Adams&Papa'!I$40*'3. CALCS_Loads'!M70)*IF(LOOKUP($A183,'3. CALCS_Loads'!$A$37:$A$44,'3. CALCS_Loads'!$C$37:$C$44)=\"CF_1\",CF_1,CF_2)*E$78","v":0},{"$f":"('5.CALCS_Adams&Papa'!J$39*'3. CALCS_Loads'!$F54+'5.CALCS_Adams&Papa'!J$40*'3. CALCS_Loads'!N70)*IF(LOOKUP($A183,'3. CALCS_Loads'!$A$37:$A$44,'3. CALCS_Loads'!$C$37:$C$44)=\"CF_1\",CF_1,CF_2)*F$78","v":0},2.1114560025418703E-5,0,0,0,3.329777026560702E-2,2.7401399857344279E-2,2.1114560025418703E-5,2.1114560025418703E-5,6.3411333122289422E-4,7.705650125666649E-4,"YES","YES"]
["TSS",{"$f":"'3. CALCS_Loads'!C$145*'3. CALCS_Loads'!C105*IF(LOOKUP($A184,'3. CALCS_Loads'!$A$37:$A$44,'3. CALCS_Loads'!$C$37:$C$44)=\"CF_1\",CF_1,CF_2)","v":35.912503857966819},{"$f":"'3. CALCS_Loads'!D$145*'3. CALCS_Loads'!D105*IF(LOOKUP($A184,'3. CALCS_Loads'!$A$37:$A$44,'3. CALCS_Loads'!$C$37:$C$44)=\"CF_1\",CF_1,CF_2)","v":0},{"$f":"'3. CALCS_Loads'!E$145*'3. CALCS_Loads'!E105*IF(LOOKUP($A184,'3. CALCS_Loads'!$A$37:$A$44,'3. CALCS_Loads'!$C$37:$C$44)=\"CF_1\",CF_1,CF_2)","v":0},{"$f":"'3. CALCS_Loads'!F$145*'3. CALCS_Loads'!F105*IF(LOOKUP($A184,'3. CALCS_Loads'!$A$37:$A$44,'3. CALCS_Loads'!$C$37:$C$44)=\"CF_1\",CF_1,CF_2)","v":0},{"$f":"'3. CALCS_Loads'!C$157*'3. CALCS_Loads'!C138*IF(LOOKUP($A184,'3. CALCS_Loads'!$A$37:$A$44,'3. CALCS_Loads'!$C$37:$C$44)=\"CF_1\",CF_1,CF_2)","v":0},{"$f":"'3. CALCS_Loads'!D$157*'3. CALCS_Loads'!D138*IF(LOOKUP($A184,'3. CALCS_Loads'!$A$37:$A$44,'3. CALCS_Loads'!$C$37:$C$44)=\"CF_1\",CF_1,CF_2)","v":0},{"$f":"'3. CALCS_Loads'!E$157*'3. CALCS_Loads'!E138*IF(LOOKUP($A184,'3. CALCS_Loads'!$A$37:$A$44,'3. CALCS_Loads'!$C$37:$C$44)=\"CF_1\",CF_1,CF_2)","v":0},{"$f":"'3. CALCS_Loads'!F$157*'3. CALCS_Loads'!F138*IF(LOOKUP($A184,'3. CALCS_Loads'!$A$37:$A$44,'3. CALCS_Loads'!$C$37:$C$44)=\"CF_1\",CF_1,CF_2)","v":0},{"$f":"'3. CALCS_Loads'!C$155*'3. CALCS_Loads'!C115*IF(LOOKUP($A184,'3. CALCS_Loads'!$A$37:$A$44,'3. CALCS_Loads'!$C$37:$C$44)=\"CF_1\",CF_1,CF_2)","v":0},{"$f":"'3. CALCS_Loads'!D$155*'3. CALCS_Loads'!D115*IF(LOOKUP($A184,'3. CALCS_Loads'!$A$37:$A$44,'3. CALCS_Loads'!$C$37:$C$44)=\"CF_1\",CF_1,CF_2)","v":0},{"$f":"'3. CALCS_Loads'!E$155*'3. CALCS_Loads'!E115*IF(LOOKUP($A184,'3. CALCS_Loads'!$A$37:$A$44,'3. CALCS_Loads'!$C$37:$C$44)=\"CF_1\",CF_1,CF_2)","v":0},{"$f":"'3. CALCS_Loads'!F$155*'3. CALCS_Loads'!F115*IF(LOOKUP($A184,'3. CALCS_Loads'!$A$37:$A$44,'3. CALCS_Loads'!$C$37:$C$44)=\"CF_1\",CF_1,CF_2)","v":0},{"$f":"'3. CALCS_Loads'!C$147*'3. CALCS_Loads'!C128*IF(LOOKUP($A184,'3. CALCS_Loads'!$A$37:$A$44,'3. CALCS_Loads'!$C$37:$C$44)=\"CF_1\",CF_1,CF_2)","v":2.4184034042407884E-3},{"$f":"'3. CALCS_Loads'!D$147*'3. CALCS_Loads'!D128*IF(LOOKUP($A184,'3. CALCS_Loads'!$A$37:$A$44,'3. CALCS_Loads'!$C$37:$C$44)=\"CF_1\",CF_1,CF_2)","v":0},{"$f":"'3. CALCS_Loads'!E$147*'3. CALCS_Loads'!E128*IF(LOOKUP($A184,'3. CALCS_Loads'!$A$37:$A$44,'3. CALCS_Loads'!$C$37:$C$44)=\"CF_1\",CF_1,CF_2)","v":0},{"$f":"'3. CALCS_Loads'!F$147*'3. CALCS_Loads'!F128*IF(LOOKUP($A184,'3. CALCS_Loads'!$A$37:$A$44,'3. CALCS_Loads'!$C$37:$C$44)=\"CF_1\",CF_1,CF_2)","v":0},{"$f":"'3. CALCS_Loads'!E43*C$84*IF(LOOKUP($A184,'3. CALCS_Loads'!$A$37:$A$44,'3. CALCS_Loads'!$C$37:$C$44)=\"CF_1\",CF_1,CF_2)","v":44.576047291054564},{"$f":"'3. CALCS_Loads'!F43*D$84*IF(LOOKUP($A184,'3. CALCS_Loads'!$A$37:$A$44,'3. CALCS_Loads'!$C$37:$C$44)=\"CF_1\",CF_1,CF_2)","v":0},{"$f":"'3. CALCS_Loads'!G43*E$84*IF(LOOKUP($A184,'3. CALCS_Loads'!$A$37:$A$44,'3. CALCS_Loads'!$C$37:$C$44)=\"CF_1\",CF_1,CF_2)","v":0},{"$f":"'3. CALCS_Loads'!H43*F$84*IF(LOOKUP($A184,'3. CALCS_Loads'!$A$37:$A$44,'3. CALCS_Loads'!$C$37:$C$44)=\"CF_1\",CF_1,CF_2)","v":0},{"$f":"('5.CALCS_Adams&Papa'!G$39*'3. CALCS_Loads'!$F55+'5.CALCS_Adams&Papa'!G$40*'3. CALCS_Loads'!K71)*IF(LOOKUP($A184,'3. CALCS_Loads'!$A$37:$A$44,'3. CALCS_Loads'!$C$37:$C$44)=\"CF_1\",CF_1,CF_2)*C$78","v":5.7942576357747528},{"$f":"('5.CALCS_Adams&Papa'!H$39*'3. CALCS_Loads'!$F55+'5.CALCS_Adams&Papa'!H$40*'3. CALCS_Loads'!L71)*IF(LOOKUP($A184,'3. CALCS_Loads'!$A$37:$A$44,'3. CALCS_Loads'!$C$37:$C$44)=\"CF_1\",CF_1,CF_2)*D$78","v":0},{"$f":"('5.CALCS_Adams&Papa'!I$39*'3. CALCS_Loads'!$F55+'5.CALCS_Adams&Papa'!I$40*'3. CALCS_Loads'!M71)*IF(LOOKUP($A184,'3. CALCS_Loads'!$A$37:$A$44,'3. CALCS_Loads'!$C$37:$C$44)=\"CF_1\",CF_1,CF_2)*E$78","v":0},{"$f":"('5.CALCS_Adams&Papa'!J$39*'3. CALCS_Loads'!$F55+'5.CALCS_Adams&Papa'!J$40*'3. CALCS_Loads'!N71)*IF(LOOKUP($A184,'3. CALCS_Loads'!$A$37:$A$44,'3. CALCS_Loads'!$C$37:$C$44)=\"CF_1\",CF_1,CF_2)*F$78","v":0},2.4184034042407884E-3,0,0,0,44.576047291054564,5.7942576357747528,2.4184034042407884E-3,2.4184034042407884E-3,5.4253428718120301E-5,4.1737933593238001E-4,"YES","YES"]
["Zn",{"$f":"'3. CALCS_Loads'!C$145*'3. CALCS_Loads'!C106*IF(LOOKUP($A185,'3. CALCS_Loads'!$A$37:$A$44,'3. CALCS_Loads'!$C$37:$C$44)=\"CF_1\",CF_1,CF_2)","v":6.3249488296934836E-3},{"$f":"'3. CALCS_Loads'!D$145*'3. CALCS_Loads'!D106*IF(LOOKUP($A185,'3. CALCS_Loads'!$A$37:$A$44,'3. CALCS_Loads'!$C$37:$C$44)=\"CF_1\",CF_1,CF_2)","v":0},{"$f":"'3. CALCS_Loads'!E$145*'3. CALCS_Loads'!E106*IF(LOOKUP($A185,'3. CALCS_Loads'!$A$37:$A$44,'3. CALCS_Loads'!$C$37:$C$44)=\"CF_1\",CF_1,CF_2)","v":0},{"$f":"'3. CALCS_Loads'!F$145*'3. CALCS_Loads'!F106*IF(LOOKUP($A185,'3. CALCS_Loads'!$A$37:$A$44,'3. CALCS_Loads'!$C$37:$C$44)=\"CF_1\",CF_1,CF_2)","v":0},{"$f":"'3. CALCS_Loads'!C$157*'3. CALCS_Loads'!C139*IF(LOOKUP($A185,'3. CALCS_Loads'!$A$37:$A$44,'3. CALCS_Loads'!$C$37:$C$44)=\"CF_1\",CF_1,CF_2)","v":0},{"$f":"'3. CALCS_Loads'!D$157*'3. CALCS_Loads'!D139*IF(LOOKUP($A185,'3. CALCS_Loads'!$A$37:$A$44,'3. CALCS_Loads'!$C$37:$C$44)=\"CF_1\",CF_1,CF_2)","v":0},{"$f":"'3. CALCS_Loads'!E$157*'3. CALCS_Loads'!E139*IF(LOOKUP($A185,'3. CALCS_Loads'!$A$37:$A$44,'3. CALCS_Loads'!$C$37:$C$44)=\"CF_1\",CF_1,CF_2)","v":0},{"$f":"'3. CALCS_Loads'!F$157*'3. CALCS_Loads'!F139*IF(LOOKUP($A185,'3. CALCS_Loads'!$A$37:$A$44,'3. CALCS_Loads'!$C$37:$C$44)=\"CF_1\",CF_1,CF_2)","v":0},{"$f":"'3. CALCS_Loads'!C$155*'3. CALCS_Loads'!C116*IF(LOOKUP($A185,'3. CALCS_Loads'!$A$37:$A$44,'3. CALCS_Loads'!$C$37:$C$44)=\"CF_1\",CF_1,CF_2)","v":0},{"$f":"'3. CALCS_Loads'!D$155*'3. CALCS_Loads'!D116*IF(LOOKUP($A185,'3. CALCS_Loads'!$A$37:$A$44,'3. CALCS_Loads'!$C$37:$C$44)=\"CF_1\",CF_1,CF_2)","v":0},{"$f":"'3. CALCS_Loads'!E$155*'3. CALCS_Loads'!E116*IF(LOOKUP($A185,'3. CALCS_Loads'!$A$37:$A$44,'3. CALCS_Loads'!$C$37:$C$44)=\"CF_1\",CF_1,CF_2)","v":0},{"$f":"'3. CALCS_Loads'!F$155*'3. CALCS_Loads'!F116*IF(LOOKUP($A185,'3. CALCS_Loads'!$A$37:$A$44,'3. CALCS_Loads'!$C$37:$C$44)=\"CF_1\",CF_1,CF_2)","v":0},{"$f":"'3. CALCS_Loads'!C$147*'3. CALCS_Loads'!C129*IF(LOOKUP($A185,'3. CALCS_Loads'!$A$37:$A$44,'3. CALCS_Loads'!$C$37:$C$44)=\"CF_1\",CF_1,CF_2)","v":2.9701727986909343E-6},{"$f":"'3. CALCS_Loads'!D$147*'3. CALCS_Loads'!D129*IF(LOOKUP($A185,'3. CALCS_Loads'!$A$37:$A$44,'3. CALCS_Loads'!$C$37:$C$44)=\"CF_1\",CF_1,CF_2)","v":0},{"$f":"'3. CALCS_Loads'!E$147*'3. CALCS_Loads'!E129*IF(LOOKUP($A185,'3. CALCS_Loads'!$A$37:$A$44,'3. CALCS_Loads'!$C$37:$C$44)=\"CF_1\",CF_1,CF_2)","v":0},{"$f":"'3. CALCS_Loads'!F$147*'3. CALCS_Loads'!F129*IF(LOOKUP($A185,'3. CALCS_Loads'!$A$37:$A$44,'3. CALCS_Loads'!$C$37:$C$44)=\"CF_1\",CF_1,CF_2)","v":0},{"$f":"'3. CALCS_Loads'!E44*C$84*IF(LOOKUP($A185,'3. CALCS_Loads'!$A$37:$A$44,'3. CALCS_Loads'!$C$37:$C$44)=\"CF_1\",CF_1,CF_2)","v":6.3279190024921744E-3},{"$f":"'3. CALCS_Loads'!F44*D$84*IF(LOOKUP($A185,'3. CALCS_Loads'!$A$37:$A$44,'3. CALCS_Loads'!$C$37:$C$44)=\"CF_1\",CF_1,CF_2)","v":0},{"$f":"'3. CALCS_Loads'!G44*E$84*IF(LOOKUP($A185,'3. CALCS_Loads'!$A$37:$A$44,'3. CALCS_Loads'!$C$37:$C$44)=\"CF_1\",CF_1,CF_2)","v":0},{"$f":"'3. CALCS_Loads'!H44*F$84*IF(LOOKUP($A185,'3. CALCS_Loads'!$A$37:$A$44,'3. CALCS_Loads'!$C$37:$C$44)=\"CF_1\",CF_1,CF_2)","v":0},{"$f":"('5.CALCS_Adams&Papa'!G$39*'3. CALCS_Loads'!$F56+'5.CALCS_Adams&Papa'!G$40*'3. CALCS_Loads'!K72)*IF(LOOKUP($A185,'3. CALCS_Loads'!$A$37:$A$44,'3. CALCS_Loads'!$C$37:$C$44)=\"CF_1\",CF_1,CF_2)*C$78","v":6.3189691879763973E-3},{"$f":"('5.CALCS_Adams&Papa'!H$39*'3. CALCS_Loads'!$F56+'5.CALCS_Adams&Papa'!H$40*'3. CALCS_Loads'!L72)*IF(LOOKUP($A185,'3. CALCS_Loads'!$A$37:$A$44,'3. CALCS_Loads'!$C$37:$C$44)=\"CF_1\",CF_1,CF_2)*D$78","v":0},{"$f":"('5.CALCS_Adams&Papa'!I$39*'3. CALCS_Loads'!$F56+'5.CALCS_Adams&Papa'!I$40*'3. CALCS_Loads'!M72)*IF(LOOKUP($A185,'3. CALCS_Loads'!$A$37:$A$44,'3. CALCS_Loads'!$C$37:$C$44)=\"CF_1\",CF_1,CF_2)*E$78","v":0},{"$f":"('5.CALCS_Adams&Papa'!J$39*'3. CALCS_Loads'!$F56+'5.CALCS_Adams&Papa'!J$40*'3. CALCS_Loads'!N72)*IF(LOOKUP($A185,'3. CALCS_Loads'!$A$37:$A$44,'3. CALCS_Loads'!$C$37:$C$44)=\"CF_1\",CF_1,CF_2)*F$78","v":0},2.9701727986909343E-6,0,0,0,6.3279190024921744E-3,6.3189691879763973E-3,2.9701727986909343E-6,2.9701727986909343E-6,4.6937591924314575E-4,4.7004071555571393E-4,"YES","YES"]
[]
["PLOT: Developed, Existing, and Sed/Fil Loadings"]
["POLLUTANT",{"$f":"IF('1. ENTER DATA'!$E$14=\"Yes\",\"Drainage Area A - Existing\",\"Drainage Area A - Sed/Fil\")","v":"Drainage Area A - Existing"},{"$f":"IF('1. ENTER DATA'!$E$14=\"Yes\",\"Drainage Area B - Existing\",\"Drainage Area B - Sed/Fil\")","v":"Drainage Area B - Existing"},{"$f":"IF('1. ENTER DATA'!$E$14=\"Yes\",\"Drainage Area C - Existing\",\"Drainage Area C - Sed/Fil\")","v":"Drainage Area C - Existing"},"Drainage Area D - Existing","Drainage Area A Developed (Treated) Load","Drainage Area B Developed (Treated) Load","Drainage Area C Developed (Treated) Load","Drainage Area D Developed (Treated) Load"]
["COD",{"$f":"IF('1. ENTER DATA'!$E$14=\"Yes\",'3. CALCS_Loads'!R178,'3. CALCS_Loads'!V178)","v":10.445832768807366},{"$f":"IF('1. ENTER DATA'!$E$14=\"Yes\",'3. CALCS_Loads'!S178,'3. CALCS_Loads'!W178)","v":0},{"$f":"IF('1. ENTER DATA'!$E$14=\"Yes\",'3. CALCS_Loads'!T178,'3. CALCS_Loads'!X178)","v":0},{"$f":"IF('1. ENTER DATA'!$E$14=\"Yes\",'3. CALCS_Loads'!U178,'3. CALCS_Loads'!Y178)","v":0},{"$f":"Z178","v":3.145137382800792E-3},0,0,0]
["E. coli",{"$f":"IF('1. ENTER DATA'!$E$14=\"Yes\",'3. CALCS_Loads'!R179,'3. CALCS_Loads'!V179)","v":10193.469623240113},{"$f":"IF('1. ENTER DATA'!$E$14=\"Yes\",'3. CALCS_Loads'!S179,'3. CALCS_Loads'!W179)","v":0},{"$f":"IF('1. ENTER DATA'!$E$14=\"Yes\",'3. CALCS_Loads'!T179,'3. CALCS_Loads'!X179)","v":0},{"$f":"IF('1. ENTER DATA'!$E$14=\"Yes\",'3. CALCS_Loads'!U179,'3. CALCS_Loads'!Y179)","v":0},4.7029872910259956,0,0,0]
["Pb",{"$f":"IF('1. ENTER DATA'!$E$14=\"Yes\",'3. CALCS_Loads'!R180,'3. CALCS_Loads'!V180)","v":1.1501157261902815E-3},{"$f":"IF('1. ENTER DATA'!$E$14=\"Yes\",'3. CALCS_Loads'!S180,'3. CALCS_Loads'!W180)","v":0},{"$f":"IF('1. ENTER DATA'!$E$14=\"Yes\",'3. CALCS_Loads'!T180,'3. CALCS_Loads'!X180)","v":0},{"$f":"IF('1. ENTER DATA'!$E$14=\"Yes\",'3. CALCS_Loads'!U180,'3. CALCS_Loads'!Y180)","v":0},5.3983662621656143E-7,0,0,0]
["TN",{"$f":"IF('1. ENTER DATA'!$E$14=\"Yes\",'3. CALCS_Loads'!R181,'3. CALCS_Loads'!V181)","v":0.31955118238768027},{"$f":"IF('1. ENTER DATA'!$E$14=\"Yes\",'3. CALCS_Loads'!S181,'3. CALCS_Loads'!W181)","v":0},{"$f":"IF('1. ENTER DATA'!$E$14=\"Yes\",'3. CALCS_Loads'!T181,'3. CALCS_Loads'!X181)","v":0},{"$f":"IF('1. ENTER DATA'!$E$14=\"Yes\",'3. CALCS_Loads'!U181,'3. CALCS_Loads'!Y181)","v":0},1.6842875663676288E-4,0,0,0]
["TOC",{"$f":"IF('1. ENTER DATA'!$E$14=\"Yes\",'3. CALCS_Loads'!R182,'3. CALCS_Loads'!V182)","v":3.4989511819424157},{"$f":"IF('1. ENTER DATA'!$E$14=\"Yes\",'3. CALCS_Loads'!S182,'3. CALCS_Loads'!W182)","v":0},{"$f":"IF('1. ENTER DATA'!$E$14=\"Yes\",'3. CALCS_Loads'!T182,'3. CALCS_Loads'!X182)","v":0},{"$f":"IF('1. ENTER DATA'!$E$14=\"Yes\",'3. CALCS_Loads'!U182,'3. CALCS_Loads'!Y182)","v":0},1.1988437757766395E-3,0,0,0]
["TP",{"$f":"IF('1. ENTER DATA'!$E$14=\"Yes\",'3. CALCS_Loads'!R183,'3. CALCS_Loads'!V183)","v":3.329777026560702E-2},{"$f":"IF('1. ENTER DATA'!$E$14=\"Yes\",'3. CALCS_Loads'!S183,'3. CALCS_Loads'!W183)","v":0},{"$f":"IF('1. ENTER DATA'!$E$14=\"Yes\",'3. CALCS_Loads'!T183,'3. CALCS_Loads'!X183)","v":0},{"$f":"IF('1. ENTER DATA'!$E$14=\"Yes\",'3. CALCS_Loads'!U183,'3. CALCS_Loads'!Y183)","v":0},{"$f":"Z183","v":2.1114560025418703E-5},0,0,0]
["TSS",{"$f":"IF('1. ENTER DATA'!$E$14=\"Yes\",'3. CALCS_Loads'!R184,'3. CALCS_Loads'!V184)","v":44.576047291054564},{"$f":"IF('1. ENTER DATA'!$E$14=\"Yes\",'3. CALCS_Loads'!S184,'3. CALCS_Loads'!W184)","v":0},{"$f":"IF('1. ENTER DATA'!$E$14=\"Yes\",'3. CALCS_Loads'!T184,'3. CALCS_Loads'!X184)","v":0},{"$f":"IF('1. ENTER DATA'!$E$14=\"Yes\",'3. CALCS_Loads'!U184,'3. CALCS_Loads'!Y184)","v":0},2.4184034042407884E-3,0,0,0]
["Zn",{"$f":"IF('1. ENTER DATA'!$E$14=\"Yes\",'3. CALCS_Loads'!R185,'3. CALCS_Loads'!V185)","v":6.3279190024921744E-3},{"$f":"IF('1. ENTER DATA'!$E$14=\"Yes\",'3. CALCS_Loads'!S185,'3. CALCS_Loads'!W185)","v":0},{"$f":"IF('1. ENTER DATA'!$E$14=\"Yes\",'3. CALCS_Loads'!T185,'3. CALCS_Loads'!X185)","v":0},{"$f":"IF('1. ENTER DATA'!$E$14=\"Yes\",'3. CALCS_Loads'!U185,'3. CALCS_Loads'!Y185)","v":0},2.9701727986909343E-6,0,0,0]
[]
["PLOT: Load Equivalency Factor (LEF)"]
["POLLUTANT","RED","GREEN"]
[null,">1","<=1"]
["COD",{"$f":"IF(IF('1. ENTER DATA'!$E$14=\"No\",LOOKUP($A201,'3. CALCS_Loads'!$A$178:$A$185,'3. CALCS_Loads'!$AI$178:$AI$185),LOOKUP('3. CALCS_Loads'!$A201,'3. CALCS_Loads'!$A$178:$A$185,'3. CALCS_Loads'!$AH$178:$AH$185))>1,IF('1. ENTER DATA'!$E$14=\"No\",LOOKUP($A201,'3. CALCS_Loads'!$A$178:$A$185,'3. CALCS_Loads'!$AI$178:$AI$185),LOOKUP('3. CALCS_Loads'!$A201,'3. CALCS_Loads'!$A$178:$A$185,'3. CALCS_Loads'!$AH$178:$AH$185)),#N/A)","v":{"$error":"#N/A"}},{"$f":"IF(IF('1. ENTER DATA'!$E$14=\"No\",LOOKUP($A201,'3. CALCS_Loads'!$A$178:$A$185,'3. CALCS_Loads'!$AI$178:$AI$185),LOOKUP('3. CALCS_Loads'!$A201,'3. CALCS_Loads'!$A$178:$A$185,'3. CALCS_Loads'!$AH$178:$AH$185))<=1,IF('1. ENTER DATA'!$E$14=\"No\",LOOKUP($A201,'3. CALCS_Loads'!$A$178:$A$185,'3. CALCS_Loads'!$AI$178:$AI$185),LOOKUP('3. CALCS_Loads'!$A201,'3. CALCS_Loads'!$A$178:$A$185,'3. CALCS_Loads'!$AH$178:$AH$185)),#N/A)","v":3.0109015263891524E-4}]
["E. coli",{"$f":"IF(IF('1. ENTER DATA'!$E$14=\"No\",LOOKUP($A202,'3. CALCS_Loads'!$A$178:$A$185,'3. CALCS_Loads'!$AI$178:$AI$185),LOOKUP('3. CALCS_Loads'!$A202,'3. CALCS_Loads'!$A$178:$A$185,'3. CALCS_Loads'!$AH$178:$AH$185))>1,IF('1. ENTER DATA'!$E$14=\"No\",LOOKUP($A202,'3. CALCS_Loads'!$A$178:$A$185,'3. CALCS_Loads'!$AI$178:$AI$185),LOOKUP('3. CALCS_Loads'!$A202,'3. CALCS_Loads'!$A$178:$A$185,'3. CALCS_Loads'!$AH$178:$AH$185)),#N/A)","v":{"$error":"#N/A"}},{"$f":"IF(IF('1. ENTER DATA'!$E$14=\"No\",LOOKUP($A202,'3. CALCS_Loads'!$A$178:$A$185,'3. CALCS_Loads'!$AI$178:$AI$185),LOOKUP('3. CALCS_Loads'!$A202,'3. CALCS_Loads'!$A$178:$A$185,'3. CALCS_Loads'!$AH$178:$AH$185))<=1,IF('1. ENTER DATA'!$E$14=\"No\",LOOKUP($A202,'3. CALCS_Loads'!$A$178:$A$185,'3. CALCS_Loads'!$AI$178:$AI$185),LOOKUP('3. CALCS_Loads'!$A202,'3. CALCS_Loads'!$A$178:$A$185,'3. CALCS_Loads'!$AH$178:$AH$185)),#N/A)","v":4.6137257134740904E-4}]
["Pb",{"$f":"IF(IF('1. ENTER DATA'!$E$14=\"No\",LOOKUP($A203,'3. CALCS_Loads'!$A$178:$A$185,'3. CALCS_Loads'!$AI$178:$AI$185),LOOKUP('3. CALCS_Loads'!$A203,'3. CALCS_Loads'!$A$178:$A$185,'3. CALCS_Loads'!$AH$178:$AH$185))>1,IF('1. ENTER DATA'!$E$14=\"No\",LOOKUP($A203,'3. CALCS_Loads'!$A$178:$A$185,'3. CALCS_Loads'!$AI$178:$AI$185),LOOKUP('3. CALCS_Loads'!$A203,'3. CALCS_Loads'!$A$178:$A$185,'3. CALCS_Loads'!$AH$178:$AH$185)),#N/A)","v":{"$error":"#N/A"}},{"$f":"IF(IF('1. ENTER DATA'!$E$14=\"No\",LOOKUP($A203,'3. CALCS_Loads'!$A$178:$A$185,'3. CALCS_Loads'!$AI$178:$AI$185),LOOKUP('3. CALCS_Loads'!$A203,'3. CALCS_Loads'!$A$178:$A$185,'3. CALCS_Loads'!$AH$178:$AH$185))<=1,IF('1. ENTER DATA'!$E$14=\"No\",LOOKUP($A203,'3. CALCS_Loads'!$A$178:$A$185,'3. CALCS_Loads'!$AI$178:$AI$185),LOOKUP('3. CALCS_Loads'!$A203,'3. CALCS_Loads'!$A$178:$A$185,'3. CALCS_Loads'!$AH$178:$AH$185)),#N/A)","v":4.693759192431457E-4}]
["TN",{"$f":"IF(IF('1. ENTER DATA'!$E$14=\"No\",LOOKUP($A204,'3. CALCS_Loads'!$A$178:$A$185,'3. CALCS_Loads'!$AI$178:$AI$185),LOOKUP('3. CALCS_Loads'!$A204,'3. CALCS_Loads'!$A$178:$A$185,'3. CALCS_Loads'!$AH$178:$AH$185))>1,IF('1. ENTER DATA'!$E$14=\"No\",LOOKUP($A204,'3. CALCS_Loads'!$A$178:$A$185,'3. CALCS_Loads'!$AI$178:$AI$185),LOOKUP('3. CALCS_Loads'!$A204,'3. CALCS_Loads'!$A$178:$A$185,'3. CALCS_Loads'!$AH$178:$AH$185)),#N/A)","v":{"$error":"#N/A"}},{"$f":"IF(IF('1. ENTER DATA'!$E$14=\"No\",LOOKUP($A204,'3. CALCS_Loads'!$A$178:$A$185,'3. CALCS_Loads'!$AI$178:$AI$185),LOOKUP('3. CALCS_Loads'!$A204,'3. CALCS_Loads'!$A$178:$A$185,'3. CALCS_Loads'!$AH$178:$AH$185))<=1,IF('1. ENTER DATA'!$E$14=\"No\",LOOKUP($A204,'3. CALCS_Loads'!$A$178:$A$185,'3. CALCS_Loads'!$AI$178:$AI$185),LOOKUP('3. CALCS_Loads'!$A204,'3. CALCS_Loads'!$A$178:$A$185,'3. CALCS_Loads'!$AH$178:$AH$185)),#N/A)","v":5.2707912196808804E-4}]
["TOC",{"$f":"IF(IF('1. ENTER DATA'!$E$14=\"No\",LOOKUP($A205,'3. CALCS_Loads'!$A$178:$A$185,'3. CALCS_Loads'!$AI$178:$AI$185),LOOKUP('3. CALCS_Loads'!$A205,'3. CALCS_Loads'!$A$178:$A$185,'3. CALCS_Loads'!$AH$178:$AH$185))>1,IF('1. ENTER DATA'!$E$14=\"No\",LOOKUP($A205,'3. CALCS_Loads'!$A$178:$A$185,'3. CALCS_Loads'!$AI$178:$AI$185),LOOKUP('3. CALCS_Loads'!$A205,'3. CALCS_Loads'!$A$178:$A$185,'3. CALCS_Loads'!$AH$178:$AH$185)),#N/A)","v":{"$error":"#N/A"}},{"$f":"IF(IF('1. ENTER DATA'!$E$14=\"No\",LOOKUP($A205,'3. CALCS_Loads'!$A$178:$A$185,'3. CALCS_Loads'!$AI$178:$AI$185),LOOKUP('3. CALCS_Loads'!$A205,'3. CALCS_Loads'!$A$178:$A$185,'3. CALCS_Loads'!$AH$178:$AH$185))<=1,IF('1. ENTER DATA'!$E$14=\"No\",LOOKUP($A205,'3. CALCS_Loads'!$A$178:$A$185,'3. CALCS_Loads'!$AI$178:$AI$185),LOOKUP('3. CALCS_Loads'!$A205,'3. CALCS_Loads'!$A$178:$A$185,'3. CALCS_Loads'!$AH$178:$AH$185)),#N/A)","v":3.4262946621367569E-4}]
["TP",{"$f":"IF(IF('1. ENTER DATA'!$E$14=\"No\",LOOKUP($A206,'3. CALCS_Loads'!$A$178:$A$185,'3. CALCS_Loads'!$AI$178:$AI$185),LOOKUP('3. CALCS_Loads'!$A206,'3. CALCS_Loads'!$A$178:$A$185,'3. CALCS_Loads'!$AH$178:$AH$185))>1,IF('1. ENTER DATA'!$E$14=\"No\",LOOKUP($A206,'3. CALCS_Loads'!$A$178:$A$185,'3. CALCS_Loads'!$AI$178:$AI$185),LOOKUP('3. CALCS_Loads'!$A206,'3. CALCS_Loads'!$A$178:$A$185,'3. CALCS_Loads'!$AH$178:$AH$185)),#N/A)","v":{"$error":"#N/A"}},{"$f":"IF(IF('1. ENTER DATA'!$E$14=\"No\",LOOKUP($A206,'3. CALCS_Loads'!$A$178:$A$185,'3. CALCS_Loads'!$AI$178:$AI$185),LOOKUP('3. CALCS_Loads'!$A206,'3. CALCS_Loads'!$A$178:$A$185,'3. CALCS_Loads'!$AH$178:$AH$185))<=1,IF('1. ENTER DATA'!$E$14=\"No\",LOOKUP($A206,'3. CALCS_Loads'!$A$178:$A$185,'3. CALCS_Loads'!$AI$178:$AI$185),LOOKUP('3. CALCS_Loads'!$A206,'3. CALCS_Loads'!$A$178:$A$185,'3. CALCS_Loads'!$AH$178:$AH$185)),#N/A)","v":6.3411333122289422E-4}]
["TSS",{"$f":"IF(IF('1. ENTER DATA'!$E$14=\"No\",LOOKUP($A207,'3. CALCS_Loads'!$A$178:$A$185,'3. CALCS_Loads'!$AI$178:$AI$185),LOOKUP('3. CALCS_Loads'!$A207,'3. CALCS_Loads'!$A$178:$A$185,'3. CALCS_Loads'!$AH$178:$AH$185))>1,IF('1. ENTER DATA'!$E$14=\"No\",LOOKUP($A207,'3. CALCS_Loads'!$A$178:$A$185,'3. CALCS_Loads'!$AI$178:$AI$185),LOOKUP('3. CALCS_Loads'!$A207,'3. CALCS_Loads'!$A$178:$A$185,'3. CALCS_Loads'!$AH$178:$AH$185)),#N/A)","v":{"$error":"#N/A"}},{"$f":"IF(IF('1. ENTER DATA'!$E$14=\"No\",LOOKUP($A207,'3. CALCS_Loads'!$A$178:$A$185,'3. CALCS_Loads'!$AI$178:$AI$185),LOOKUP('3. CALCS_Loads'!$A207,'3. CALCS_Loads'!$A$178:$A$185,'3. CALCS_Loads'!$AH$178:$AH$185))<=1,IF('1. ENTER DATA'!$E$14=\"No\",LOOKUP($A207,'3. CALCS_Loads'!$A$178:$A$185,'3. CALCS_Loads'!$AI$178:$AI$185),LOOKUP('3. CALCS_Loads'!$A207,'3. CALCS_Loads'!$A$178:$A$185,'3. CALCS_Loads'!$AH$178:$AH$185)),#N/A)","v":5.4253428718120301E-5}]
["Zn",{"$f":"IF(IF('1. ENTER DATA'!$E$14=\"No\",LOOKUP($A208,'3. CALCS_Loads'!$A$178:$A$185,'3. CALCS_Loads'!$AI$178:$AI$185),LOOKUP('3. CALCS_Loads'!$A208,'3. CALCS_Loads'!$A$178:$A$185,'3. CALCS_Loads'!$AH$178:$AH$185))>1,IF('1. ENTER DATA'!$E$14=\"No\",LOOKUP($A208,'3. CALCS_Loads'!$A$178:$A$185,'3. CALCS_Loads'!$AI$178:$AI$185),LOOKUP('3. CALCS_Loads'!$A208,'3. CALCS_Loads'!$A$178:$A$185,'3. CALCS_Loads'!$AH$178:$AH$185)),#N/A)","v":{"$error":"#N/A"}},{"$f":"IF(IF('1. ENTER DATA'!$E$14=\"No\",LOOKUP($A208,'3. CALCS_Loads'!$A$178:$A$185,'3. CALCS_Loads'!$AI$178:$AI$185),LOOKUP('3. CALCS_Loads'!$A208,'3. CALCS_Loads'!$A$178:$A$185,'3. CALCS_Loads'!$AH$178:$AH$185))<=1,IF('1. ENTER DATA'!$E$14=\"No\",LOOKUP($A208,'3. CALCS_Loads'!$A$178:$A$185,'3. CALCS_Loads'!$AI$178:$AI$185),LOOKUP('3. CALCS_Loads'!$A208,'3. CALCS_Loads'!$A$178:$A$185,'3. CALCS_Loads'!$AH$178:$AH$185)),#N/A)","v":4.6937591924314575E-4}]

{"sheet":"4. CALCS_Infiltration","index":3,"n_rows":39,"n_cols":10,"rows_kept":39,"cut":false,"hidden":false,"merged":[]}
["SIZING INFILTRATION FIELDS"]
[]
[null,null,null,null,"SCM A2","SCM B2","SCM C2","SCM D2"]
["Drainage Area",null,null,"Ac",{"$f":"DA_A","v":1},{"$f":"DA_B","v":1},{"$f":"DA_C","v":1},{"$f":"DA_D","v":1},null,"*Assume: More helpful to start with \"Volume treated\" and then back-calculate the area required. "]
["Water application factor",null,null,null,{"$f":"1/'1. ENTER DATA'!E52","v":0.5},{"$f":"1/'1. ENTER DATA'!F52","v":0.5},{"$f":"1/'1. ENTER DATA'!G52","v":0.5},{"$f":"1/'1. ENTER DATA'!H52","v":0.5},null,"(Between 12 and 72 hours), longer duration = smaller field area"]
["Total irrigation time",null,null,"hrs",{"$f":"'1. ENTER DATA'!E54","v":60},{"$f":"'1. ENTER DATA'!F54","v":60},{"$f":"'1. ENTER DATA'!G54","v":60},{"$f":"'1. ENTER DATA'!H54","v":60},null,"Accounts for alternating on/off watering"]
["Water application time",null,null,"hrs",{"$f":"E6*E5","v":30},{"$f":"F6*F5","v":30},{"$f":"G6*G5","v":30},{"$f":"H6*H5","v":30},null,"0.03 in/hr"]
["Soil Infiltration Rate (permeability)",null,null,"in/hr",{"$f":"'1. ENTER DATA'!E53","v":0.2},{"$f":"'1. ENTER DATA'!F53","v":0.2},{"$f":"'1. ENTER DATA'!G53","v":0.2},{"$f":"'1. ENTER DATA'!H53","v":0.2}]
[]
["1. Volume Unknown to User, Use All Routed Volume, Calculate Area"]
["WQV",null,null,"in",{"$f":"'1. ENTER DATA'!E44","v":2.5},{"$f":"'1. ENTER DATA'!F44","v":2.5},{"$f":"'1. ENTER DATA'!G44","v":2.5},{"$f":"'1. ENTER DATA'!H44","v":2.5}]
["Corresponding Yearly Volume infiltrated ",null,null,"in/yr",{"$f":"'1. ENTER DATA'!E45","v":1.1839627863340727},{"$f":"'1. ENTER DATA'!F45","v":0},{"$f":"'1. ENTER DATA'!G45","v":0},{"$f":"'1. ENTER DATA'!H45","v":0}]
["Max Infiltrated Volume per event",null,null,"ft^3",{"$f":"E11*E4*3630","v":9075},{"$f":"F11*F4*3630","v":9075},9075,9075]
["Field Area",null,null,"Acres",{"$f":"E13/(E$8*E$7*3630)","v":0.41666666666666669},{"$f":"F13/(F$8*F$7*3630)","v":0.41666666666666669},0.41666666666666669,0.41666666666666669]
[]
["2. Volume Known and User-Input, Calculate Area"]
["Corresponding WQV",null,null,"in",{"$f":"'1. ENTER DATA'!E48","v":0},{"$f":"'1. ENTER DATA'!F48","v":0},{"$f":"'1. ENTER DATA'!G48","v":0},{"$f":"'1. ENTER DATA'!H48","v":0}]
["Corresponding Yearly Volume infiltrated ",null,null,"in/yr",{"$f":"LOOKUP(E17,'5.CALCS_Adams&Papa'!$A$62:$A$1062,'5.CALCS_Adams&Papa'!B$62:B$1062)","v":0},{"$f":"LOOKUP(F17,'5.CALCS_Adams&Papa'!$A$62:$A$1062,'5.CALCS_Adams&Papa'!C$62:C$1062)","v":0},{"$f":"LOOKUP(G17,'5.CALCS_Adams&Papa'!$A$62:$A$1062,'5.CALCS_Adams&Papa'!D$62:D$1062)","v":0},{"$f":"LOOKUP(H17,'5.CALCS_Adams&Papa'!$A$62:$A$1062,'5.CALCS_Adams&Papa'!E$62:E$1062)","v":0}]
["Max Infiltrated Volume per event",null,null,"ft^3",{"$f":"E17*E4*3630","v":0},{"$f":"F17*F4*3630","v":0},0,0]
["Field Area",null,null,"Acres",{"$f":"E19/(E$8*E$7*3630)","v":0},{"$f":"F19/(F$8*F$7*3630)","v":0},{"$f":"G19/(G$8*G$7*3630)","v":0},{"$f":"H19/(H$8*H$7*3630)","v":0}]
[]
["3. Area Known, Calculate Volume"]
["Corresponding WQV",null,null,"in",{"$f":"E25/DA_A/3630","v":0},{"$f":"F25/DA_B/3630","v":0},{"$f":"G25/DA_C/3630","v":0},{"$f":"H25/DA_D/3630","v":0}]
["Corresponding Yearly Volume Infiltrated",null,null,"in/yr",{"$f":"LOOKUP(E23,'5.CALCS_Adams&Papa'!$A$62:$A$1062,'5.CALCS_Adams&Papa'!B$62:B$1062)","v":0},{"$f":"LOOKUP(F23,'5.CALCS_Adams&Papa'!$A$62:$A$1062,'5.CALCS_Adams&Papa'!C$62:C$1062)","v":0},{"$f":"LOOKUP(G23,'5.CALCS_Adams&Papa'!$A$62:$A$1062,'5.CALCS_Adams&Papa'!D$62:D$1062)","v":0},{"$f":"LOOKUP(H23,'5.CALCS_Adams&Papa'!$A$62:$A$1062,'5.CALCS_Adams&Papa'!E$62:E$1062)","v":0}]
["Max Infiltrated Volume per event",null,null,"ft^3",{"$f":"E26*E$8*E$7*3630","v":0},{"$f":"F26*F$8*F$7*3630","v":0},{"$f":"G26*G$8*G$7*3630","v":0},{"$f":"H26*H$8*H$7*3630","v":0}]
["Field Area",null,null,"Acres",{"$f":"'1. ENTER DATA'!E56","v":0},{"$f":"'1. ENTER DATA'!F56","v":0},{"$f":"'1. ENTER DATA'!G56","v":0},{"$f":"'1. ENTER DATA'!H56","v":0}]
["Sufficient Field Area Provided?",null,null,null,{"$f":"IF(E26>=E14,\"Yes\",\"No\")","v":"No"},{"$f":"IF(F26>=F14,\"Yes\",\"No\")","v":"No"},{"$f":"IF(G26>=G14,\"Yes\",\"No\")","v":"No"},{"$f":"IF(H26>=H14,\"Yes\",\"No\")","v":"No"}]
[]
["4. Minimum Volume Known, Calculate Minimum Area"]
["Yearly Volume infiltrated ",null,null,"Ac-in/yr",{"$f":"ROUNDUP('3. CALCS_Loads'!V172,2)","v":0.53},{"$f":"ROUNDUP('3. CALCS_Loads'!W172,2)","v":0},{"$f":"ROUNDUP('3. CALCS_Loads'!X172,2)","v":0},{"$f":"ROUNDUP('3. CALCS_Loads'!Y172,2)","v":0}]
["Corresponding WQV",null,null,"in",{"$f":"LOOKUP(E30,'5.CALCS_Adams&Papa'!B$62:B$1062,'5.CALCS_Adams&Papa'!$A$62:$A$1062)+0.01","v":0.01},{"$f":"LOOKUP(F30,'5.CALCS_Adams&Papa'!C$62:C$1062,'5.CALCS_Adams&Papa'!$A$62:$A$1062)+0.01","v":0.01},{"$f":"LOOKUP(G30,'5.CALCS_Adams&Papa'!D$62:D$1062,'5.CALCS_Adams&Papa'!$A$62:$A$1062)+0.01","v":0.01},{"$f":"LOOKUP(H30,'5.CALCS_Adams&Papa'!E$62:E$1062,'5.CALCS_Adams&Papa'!$A$62:$A$1062)+0.01","v":0.01}]
["Infiltrated Volume",null,null,"ft^3",{"$f":"E31*DA_A*3630","v":36.300000000000004},{"$f":"F31*DA_B*3630","v":36.300000000000004},{"$f":"G31*DA_C*3630","v":36.300000000000004},{"$f":"H31*DA_D*3630","v":36.300000000000004}]
["Field Area",null,null,"Acres",{"$f":"E32/(E$8*E$7*3630)","v":1.6666666666666668E-3},{"$f":"F32/(F$8*F$7*3630)","v":1.6666666666666668E-3},{"$f":"G32/(G$8*G$7*3630)","v":1.6666666666666668E-3},{"$f":"H32/(H$8*H$7*3630)","v":1.6666666666666668E-3}]
[]
["5. Values for Use in Calculator"]
[null,null,null,null,"SCM A2","SCM B2","SCM C2","SCM D2"]
["Field Area to Use (Ac)",null,null,null,{"$f":"IF('1. ENTER DATA'!E55=\"Yes\",E26,IF('1. ENTER DATA'!E47=\"Yes\",E20,E14))","v":0.41666666666666669},{"$f":"IF('1. ENTER DATA'!F55=\"Yes\",F26,IF('1. ENTER DATA'!F47=\"Yes\",F20,F14))","v":0.41666666666666669},{"$f":"IF('1. ENTER DATA'!G55=\"Yes\",G26,IF('1. ENTER DATA'!G47=\"Yes\",G20,G14))","v":0.41666666666666669},{"$f":"IF('1. ENTER DATA'!H55=\"Yes\",H26,IF('1. ENTER DATA'!H47=\"Yes\",H20,H14))","v":0.41666666666666669}]
["Yearly Volume Infiltrated to Use (Ac-in/yr)",null,null,null,{"$f":"IF('1. ENTER DATA'!E47=\"Yes\",'4. CALCS_Infiltration'!E18,'4. CALCS_Infiltration'!E12)","v":1.1839627863340727},{"$f":"IF('1. ENTER DATA'!F47=\"Yes\",'4. CALCS_Infiltration'!F18,'4. CALCS_Infiltration'!F12)","v":0},{"$f":"IF('1. ENTER DATA'!G47=\"Yes\",'4. CALCS_Infiltration'!G18,'4. CALCS_Infiltration'!G12)","v":0},{"$f":"IF('1. ENTER DATA'!H47=\"Yes\",'4. CALCS_Infiltration'!H18,'4. CALCS_Infiltration'!H12)","v":0}]
["Quality Check: Min. Field area for routed volume",null,null,null,{"$f":"IF('1. ENTER DATA'!E47=\"Yes\",'4. CALCS_Infiltration'!E20,'4. CALCS_Infiltration'!E14)","v":0.41666666666666669},{"$f":"IF('1. ENTER DATA'!F47=\"Yes\",'4. CALCS_Infiltration'!F20,'4. CALCS_Infiltration'!F14)","v":0.41666666666666669},{"$f":"IF('1. ENTER DATA'!G47=\"Yes\",'4. CALCS_Infiltration'!G20,'4. CALCS_Infiltration'!G14)","v":0.41666666666666669},{"$f":"IF('1. ENTER DATA'!H47=\"Yes\",'4. CALCS_Infiltration'!H20,'4. CALCS_Infiltration'!H14)","v":0.41666666666666669}]

{"sheet":"5.CALCS_Adams&Papa","index":4,"n_rows":1062,"n_cols":11,"rows_kept":1062,"cut":false,"hidden":false,"merged":[[0,0,0,12]]}
["ADAMS & PAPA FOR VOLUMETRIC STORMWATER CONTROL MEASURE"]
[]
["Rainfall Statistics"]
["Parameter","Symbol","Value"]
["Mean annual rainfall event volume (in.)","v",{"$f":"'3. CALCS_Loads'!$A$2/'3. CALCS_Loads'!$A$3","v":0.39997478885667465}]
["Mean annual rainfall event duration (hr)","t",5.77]
["Mean annual rainfall event intensity (in/hr)","i",8.3000000000000004E-2]
["Delta = Time interval between storm event midpoints (hr)","Δ",109.4,null,"='5.CALCS_Adams&Papa'!B53*C75*C141"]
["Interevent time, b (hr) - Figure 4.2 in A&P","b",{"$f":"$C$8-$C$6","v":103.63000000000001}]
["Minimum Interevent Time (hr)","IETD",6]
["Psi = 1/(b - IETD)  but using simpler 1/b (1/hr)","y",{"$f":"1/C9","v":9.6497153333976633E-3}]
["Theta = avg. annual number of rainfall events","θ",{"$f":"'3. CALCS_Loads'!A3","v":79.33}]
["Average Annual total rainfall (in.)","P",{"$f":"'3. CALCS_Loads'!A2","v":31.73}]
["Zeta = 1/mean rainfall event volume (1/in)","z",{"$f":"1/v","v":2.5001575795776869}]
["Lambda = 1/mean rainfall event duration (1/hr)","l",{"$f":"1/t","v":0.1733102253032929}]
[]
["Drainage Area","Drainage Area A","Drainage Area B","Drainage Area C","Drainage Area D",null,"Drainage Area A","Drainage Area B","Drainage Area C","Drainage Area D"]
[]
["DRAINAGE AREA CHARACTERISTICS"]
["Drainage Area (acres) DA",{"$f":"'1. ENTER DATA'!E17","v":1},{"$f":"'1. ENTER DATA'!F17","v":1},{"$f":"'1. ENTER DATA'!G17","v":1},{"$f":"'1. ENTER DATA'!H17","v":1},null,{"$f":"DA_A","v":1},{"$f":"DA_B","v":1},{"$f":"DA_C","v":1},{"$f":"DA_D","v":1}]
["Runoff Coefficient Rv",{"$f":"RvA_d","v":6.4399999999999999E-2},{"$f":"RvB_d","v":6.4399999999999999E-2},{"$f":"RvC_d","v":6.4399999999999999E-2},{"$f":"RvD_d","v":6.4399999999999999E-2},null,{"$f":"RvA_d","v":6.4399999999999999E-2},{"$f":"RvB_d","v":6.4399999999999999E-2},{"$f":"RvC_d","v":6.4399999999999999E-2},{"$f":"RvD_d","v":6.4399999999999999E-2}]
["Depression Storage, Sd (in.)",{"$f":"SdA_d","v":0.21809999999999999},{"$f":"SdB_d","v":0.21809999999999999},{"$f":"SdC_d","v":0.21809999999999999},{"$f":"SdD_d","v":0.21809999999999999},null,{"$f":"SdA_d","v":0.21809999999999999},{"$f":"SdB_d","v":0.21809999999999999},{"$f":"SdC_d","v":0.21809999999999999},{"$f":"SdD_d","v":0.21809999999999999}]
[]
["SCM 1 (First in Series) Type",{"$f":"'1. ENTER DATA'!E26","v":"Retention Basin"},{"$f":"'1. ENTER DATA'!F26","v":"Retention Basin"},{"$f":"'1. ENTER DATA'!G26","v":"Retention Basin"},{"$f":"'1. ENTER DATA'!H26","v":"Retention Basin"},null,"Sed/Fil Std","Sed/Fil Std","Sed/Fil Std","Sed/Fil Std"]
["Water Quality Volume (in.)",{"$f":"WQV_A1","v":2.5},{"$f":"WQV_B1","v":2.5},{"$f":"WQV_C1","v":2.5},{"$f":"WQV_D1","v":2.5},null,{"$f":"0.5+(ICA_d-20)/10*0.1","v":0.3},{"$f":"0.5+(ICB_d-20)/10*0.1","v":0.3},{"$f":"0.5+(ICC_d-20)/10*0.1","v":0.3},{"$f":"0.5+(ICD_d-20)/10*0.1","v":0.3}]
["Design Drawdown Time (hr), DDT",{"$f":"DDT_A1","v":60},{"$f":"DDT_B1","v":60},{"$f":"DDT_C1","v":60},{"$f":"DDT_D1","v":60},null,48,48,48,48]
["Effective Drawdown Time (add lag time) (hr), tD",{"$f":"B26+'1. ENTER DATA'!E39","v":72},{"$f":"C26+'1. ENTER DATA'!F39","v":72},{"$f":"D26+'1. ENTER DATA'!G39","v":72},{"$f":"E26+'1. ENTER DATA'!H39","v":72},null,{"$f":"G26","v":48},{"$f":"H26","v":48},48,{"$f":"J26","v":48}]
[]
["AVERAGE ANNUAL RUNOFF CAPTURE ANALYSIS"]
["Design Treatment Rate (in/hr)",{"$f":"B25/B27","v":3.4722222222222224E-2},{"$f":"C25/C27","v":3.4722222222222224E-2},3.4722222222222224E-2,3.4722222222222224E-2,null,6.2499999999999995E-3,6.2499999999999995E-3,6.2499999999999995E-3,6.2499999999999995E-3]
["Avg. Annual Number of Runoff Events Eqn. 7.9",{"$f":"THETA*EXP(-ZETA*B22)","v":45.985769926556991},{"$f":"THETA*EXP(-ZETA*C22)","v":45.985769926556991},{"$f":"THETA*EXP(-ZETA*D22)","v":45.985769926556991},{"$f":"THETA*EXP(-ZETA*E22)","v":45.985769926556991},null,{"$f":"THETA*EXP(-ZETA*G22)","v":45.985769926556991},{"$f":"THETA*EXP(-ZETA*H22)","v":45.985769926556991},{"$f":"THETA*EXP(-ZETA*I22)","v":45.985769926556991},{"$f":"THETA*EXP(-ZETA*J22)","v":45.985769926556991}]
["Avg. Runoff Volume per event (in.)",{"$f":"$C$13/THETA*B21","v":2.5758376402369845E-2},{"$f":"$C$13/THETA*C21","v":2.5758376402369845E-2},{"$f":"$C$13/THETA*D21","v":2.5758376402369845E-2},{"$f":"$C$13/THETA*E21","v":2.5758376402369845E-2},null,{"$f":"$C$13/THETA*G21","v":2.5758376402369845E-2},{"$f":"$C$13/THETA*H21","v":2.5758376402369845E-2},{"$f":"$C$13/THETA*I21","v":2.5758376402369845E-2},{"$f":"$C$13/THETA*J21","v":2.5758376402369845E-2}]
["R Average Annual Runoff Volume (in.)",{"$f":"B31*B32","v":1.1845187709210345},{"$f":"C31*C32","v":1.1845187709210345},{"$f":"D31*D32","v":1.1845187709210345},{"$f":"E31*E32","v":1.1845187709210345},null,{"$f":"G31*G32","v":1.1845187709210345},{"$f":"H31*H32","v":1.1845187709210345},1.1845187709210345,{"$f":"J31*J32","v":1.1845187709210345}]
["Probability of Spill Occurring (GP) Eqn. 8.4a",{"$f":"B27/(B27+t*B25/(v*B21))*(B27/(b*B25)+1/(v*B21)*EXP(-(B27/(b*B25)+1/(v*B21))*B25))/(B27/(b*B25)+1/(v*B21))*EXP(-B22/v)","v":4.6937591924310629E-4},{"$f":"C27/(C27+t*C25/(v*C21))*(C27/(b*C25)+1/(v*C21)*EXP(-(C27/(b*C25)+1/(v*C21))*C25))/(C27/(b*C25)+1/(v*C21))*EXP(-C22/v)","v":4.6937591924310629E-4},{"$f":"D27/(D27+t*D25/(v*D21))*(D27/(b*D25)+1/(v*D21)*EXP(-(D27/(b*D25)+1/(v*D21))*D25))/(D27/(b*D25)+1/(v*D21))*EXP(-D22/v)","v":4.6937591924310629E-4},{"$f":"E27/(E27+t*E25/(v*E21))*(E27/(b*E25)+1/(v*E21)*EXP(-(E27/(b*E25)+1/(v*E21))*E25))/(E27/(b*E25)+1/(v*E21))*EXP(-E22/v)","v":4.6937591924310629E-4},null,{"$f":"G27/(G27+t*G25/(v*G21))*(G27/(b*G25)+1/(v*G21)*EXP(-(G27/(b*G25)+1/(v*G21))*G25))/(G27/(b*G25)+1/(v*G21))*EXP(-G22/v)","v":9.2394311283100772E-3},{"$f":"H27/(H27+t*H25/(v*H21))*(H27/(b*H25)+1/(v*H21)*EXP(-(H27/(b*H25)+1/(v*H21))*H25))/(H27/(b*H25)+1/(v*H21))*EXP(-H22/v)","v":9.2394311283100772E-3},{"$f":"I27/(I27+t*I25/(v*I21))*(I27/(b*I25)+1/(v*I21)*EXP(-(I27/(b*I25)+1/(v*I21))*I25))/(I27/(b*I25)+1/(v*I21))*EXP(-I22/v)","v":9.2394311283100772E-3},{"$f":"J27/(J27+t*J25/(v*J21))*(J27/(b*J25)+1/(v*J21)*EXP(-(J27/(b*J25)+1/(v*J21))*J25))/(J27/(b*J25)+1/(v*J21))*EXP(-J22/v)","v":9.2394311283100772E-3}]
["Avg. Annual Number of Spills Eqn. 8.18",{"$f":"THETA*B34","v":3.7235591673555619E-2},{"$f":"THETA*C34","v":3.7235591673555619E-2},{"$f":"THETA*D34","v":3.7235591673555619E-2},{"$f":"THETA*E34","v":3.7235591673555619E-2},null,{"$f":"THETA*G34","v":0.73296407140883846},{"$f":"THETA*H34","v":0.73296407140883846},{"$f":"THETA*I34","v":0.73296407140883846},{"$f":"THETA*J34","v":0.73296407140883846}]
["Pu Average Annual Spill Volume (in.) Eqn. 8.22",{"$f":"B35*B21/ZETA","v":9.5912838589239417E-4},{"$f":"C35*C21/ZETA","v":9.5912838589239417E-4},{"$f":"D35*D21/ZETA","v":9.5912838589239417E-4},{"$f":"E35*E21/ZETA","v":9.5912838589239417E-4},null,{"$f":"G35*G21/ZETA","v":1.8879964440762353E-2},{"$f":"H35*H21/ZETA","v":1.8879964440762353E-2},{"$f":"I35*I21/ZETA","v":1.8879964440762353E-2},{"$f":"J35*J21/ZETA","v":1.8879964440762353E-2}]
["Average Annual Runoff Capture Efficiency RCE (%)",{"$f":"1-B34","v":0.99953062408075688},{"$f":"1-C34","v":0.99953062408075688},0.99953062408075688,{"$f":"1-E34","v":0.99953062408075688},null,{"$f":"1-G34","v":0.99076056887168995},{"$f":"1-H34","v":0.99076056887168995},0.99076056887168995,{"$f":"1-J34","v":0.99076056887168995}]
["Avg. Annual Runoff Volume Captured RC (in.)",{"$f":"B33*B37","v":1.1839627863340727},{"$f":"C33*C37","v":1.1839627863340727},1.1839627863340727,{"$f":"E33*E37","v":1.1839627863340727},null,{"$f":"G33*G37","v":1.1735744913169193},{"$f":"H33*H37","v":1.1735744913169193},1.1735744913169193,{"$f":"J33*J37","v":1.1735744913169193}]
["Volume treated (Acre-in/yr)",{"$f":"B38*B20","v":1.1839627863340727},{"$f":"C38*C20","v":1.1839627863340727},{"$f":"D38*D20","v":1.1839627863340727},{"$f":"E38*E20","v":1.1839627863340727},null,{"$f":"G38*G20","v":1.1735744913169193},{"$f":"H38*H20","v":1.1735744913169193},{"$f":"I38*I20","v":1.1735744913169193},{"$f":"J38*J20","v":1.1735744913169193}]
["Bypass Volume (Acre-in/yr)",{"$f":"B33*B34*B20","v":5.5598458696177501E-4},{"$f":"C33*C34*C20","v":5.5598458696177501E-4},5.5598458696177501E-4,5.5598458696177501E-4,null,{"$f":"G33*G34*G20","v":1.09442796041154E-2},{"$f":"H33*H34*H20","v":1.09442796041154E-2},1.09442796041154E-2,1.09442796041154E-2]
[]
["SCM 2 (Second in Series) Type",{"$f":"'1. ENTER DATA'!E42","v":"Infiltration Field"},{"$f":"'1. ENTER DATA'!F42","v":"Infiltration Field"},{"$f":"'1. ENTER DATA'!G42","v":"Infiltration Field"},{"$f":"'1. ENTER DATA'!H42","v":"Infiltration Field"},null,"Sed/Fil Std","Sed/Fil Std","Sed/Fil Std","Sed/Fil Std","*Note: This is for calculating how much is routed to SCM 2, not focusing on SCM 2 properties specifically. "]
["Water Quality Volume (in.) Routed",{"$f":"IF(AND('1. ENTER DATA'!E46=\"Yes\",'1. ENTER DATA'!E47=\"Yes\"),'1. ENTER DATA'!E48,WQV_A1*'1. ENTER DATA'!E43/100)","v":2.5},{"$f":"IF(AND('1. ENTER DATA'!F46=\"Yes\",'1. ENTER DATA'!F47=\"Yes\"),'1. ENTER DATA'!F48,WQV_B1*'1. ENTER DATA'!F43/100)","v":2.5},{"$f":"IF(AND('1. ENTER DATA'!G46=\"Yes\",'1. ENTER DATA'!G47=\"Yes\"),'1. ENTER DATA'!G48,WQV_C1*'1. ENTER DATA'!G43/100)","v":2.5},{"$f":"IF(AND('1. ENTER DATA'!H46=\"Yes\",'1. ENTER DATA'!H47=\"Yes\"),'1. ENTER DATA'!H48,WQV_D1*'1. ENTER DATA'!H43/100)","v":2.5},null,{"$f":"WQV_A1*'1. ENTER DATA'!E43/100","v":2.5},{"$f":"WQV_B1*'1. ENTER DATA'!F43/100","v":2.5},{"$f":"WQV_C1*'1. ENTER DATA'!G43/100","v":2.5},{"$f":"WQV_D1*'1. ENTER DATA'!H43/100","v":2.5}]
["Effective Drawdown Time (includes lag time) (hr)",{"$f":"B27","v":72},{"$f":"C27","v":72},{"$f":"D27","v":72},{"$f":"E27","v":72},null,{"$f":"DDT_A1+$C$6","v":65.77},{"$f":"DDT_B1+$C$6","v":65.77},{"$f":"DDT_C1+$C$6","v":65.77},{"$f":"DDT_D1+$C$6","v":65.77}]
["Design Treatment Rate (in/hr)",{"$f":"B43/B44","v":3.4722222222222224E-2},{"$f":"C43/C44","v":3.4722222222222224E-2},{"$f":"D43/D44","v":3.4722222222222224E-2},{"$f":"E43/E44","v":3.4722222222222224E-2},null,{"$f":"G43/G44","v":3.8011251330393798E-2},{"$f":"H43/H44","v":3.8011251330393798E-2},{"$f":"I43/I44","v":3.8011251330393798E-2},{"$f":"J43/J44","v":3.8011251330393798E-2}]
[]
["AVERAGE ANNUAL RUNOFF CAPTURE ANALYSIS"]
["W Treatment Rate (in/hr)",{"$f":"B43/B44","v":3.4722222222222224E-2},{"$f":"C43/C44","v":3.4722222222222224E-2},3.4722222222222224E-2,3.4722222222222224E-2,null,{"$f":"G43/G44","v":3.8011251330393798E-2},3.8011251330393798E-2,3.8011251330393798E-2,3.8011251330393798E-2]
["Probability of Spill Occurring (GP) Eqn. 8.4a",{"$f":"(LAMBDA/B48)/((LAMBDA/B48)+(ZETA/B21))*((PSI/B48)+((ZETA/B21)*EXP(-B43*((PSI/B48)+(ZETA/B21)))))/((PSI/B48)+(ZETA/B21))*EXP(-ZETA*B22)","v":4.6937591924310618E-4},{"$f":"(LAMBDA/C48)/((LAMBDA/C48)+(ZETA/C21))*((PSI/C48)+((ZETA/C21)*EXP(-C43*((PSI/C48)+(ZETA/C21)))))/((PSI/C48)+(ZETA/C21))*EXP(-ZETA*C22)","v":4.6937591924310618E-4},{"$f":"(LAMBDA/D48)/((LAMBDA/D48)+(ZETA/D21))*((PSI/D48)+((ZETA/D21)*EXP(-D43*((PSI/D48)+(ZETA/D21)))))/((PSI/D48)+(ZETA/D21))*EXP(-ZETA*D22)","v":4.6937591924310618E-4},{"$f":"(LAMBDA/E48)/((LAMBDA/E48)+(ZETA/E21))*((PSI/E48)+((ZETA/E21)*EXP(-E43*((PSI/E48)+(ZETA/E21)))))/((PSI/E48)+(ZETA/E21))*EXP(-ZETA*E22)","v":4.6937591924310618E-4},null,{"$f":"(LAMBDA/G48)/((LAMBDA/G48)+(ZETA/G21))*((PSI/G48)+((ZETA/G21)*EXP(-G43*((PSI/G48)+(ZETA/G21)))))/((PSI/G48)+(ZETA/G21))*EXP(-ZETA*G22)","v":3.9580468574481676E-4},{"$f":"(LAMBDA/H48)/((LAMBDA/H48)+(ZETA/H21))*((PSI/H48)+((ZETA/H21)*EXP(-H43*((PSI/H48)+(ZETA/H21)))))/((PSI/H48)+(ZETA/H21))*EXP(-ZETA*H22)","v":3.9580468574481676E-4},{"$f":"(LAMBDA/I48)/((LAMBDA/I48)+(ZETA/I21))*((PSI/I48)+((ZETA/I21)*EXP(-I43*((PSI/I48)+(ZETA/I21)))))/((PSI/I48)+(ZETA/I21))*EXP(-ZETA*I22)","v":3.9580468574481676E-4},{"$f":"(LAMBDA/J48)/((LAMBDA/J48)+(ZETA/J21))*((PSI/J48)+((ZETA/J21)*EXP(-J43*((PSI/J48)+(ZETA/J21)))))/((PSI/J48)+(ZETA/J21))*EXP(-ZETA*J22)","v":3.9580468574481676E-4}]
["Avg. Annual Number of Spills Eqn. 8.18",{"$f":"THETA*B49","v":3.7235591673555613E-2},{"$f":"THETA*C49","v":3.7235591673555613E-2},{"$f":"THETA*D49","v":3.7235591673555613E-2},{"$f":"THETA*E49","v":3.7235591673555613E-2},null,{"$f":"THETA*G49","v":3.1399185720136315E-2},{"$f":"THETA*H49","v":3.1399185720136315E-2},{"$f":"THETA*I49","v":3.1399185720136315E-2},{"$f":"THETA*J49","v":3.1399185720136315E-2}]
["Pu Average Annual Spill Volume (in.) Eqn. 8.22",{"$f":"B50*B21/ZETA","v":9.5912838589239395E-4},{"$f":"C50*C21/ZETA","v":9.5912838589239395E-4},{"$f":"D50*D21/ZETA","v":9.5912838589239395E-4},{"$f":"E50*E21/ZETA","v":9.5912838589239395E-4},null,{"$f":"G50*G21/ZETA","v":8.0879204450718756E-4},{"$f":"H50*H21/ZETA","v":8.0879204450718756E-4},{"$f":"I50*I21/ZETA","v":8.0879204450718756E-4},{"$f":"J50*J21/ZETA","v":8.0879204450718756E-4}]
["Average Annual Runoff Capture Efficiency RCE (%)",{"$f":"1-B49","v":0.99953062408075688},{"$f":"1-C49","v":0.99953062408075688},{"$f":"1-D49","v":0.99953062408075688},{"$f":"1-E49","v":0.99953062408075688},null,{"$f":"1-G49","v":0.99960419531425515},{"$f":"1-H49","v":0.99960419531425515},0.99960419531425515,{"$f":"1-J49","v":0.99960419531425515}]
["Avg. Annual Runoff Volume Captured RC (in/yr)",{"$f":"B33*B52","v":1.1839627863340727},{"$f":"C33*C52","v":1.1839627863340727},{"$f":"D33*D52","v":1.1839627863340727},{"$f":"E33*E52","v":1.1839627863340727},null,{"$f":"G33*G52","v":1.1840499328411513},{"$f":"H33*H52","v":1.1840499328411513},{"$f":"I33*I52","v":1.1840499328411513},{"$f":"J33*J52","v":1.1840499328411513}]
["Avg. Annual Volume Captured (Acre-in/yr)",{"$f":"B53*B20","v":1.1839627863340727},{"$f":"C53*C20","v":1.1839627863340727},{"$f":"D53*D20","v":1.1839627863340727},{"$f":"E53*E20","v":1.1839627863340727},null,{"$f":"G53*G20","v":1.1840499328411513},{"$f":"H53*H20","v":1.1840499328411513},{"$f":"I53*I20","v":1.1840499328411513},{"$f":"J53*J20","v":1.1840499328411513}]
[]
[]
[null,{"$f":"1/B33*B112","v":0.99216177664100413}]
[]
["RANGE OF WQVs"]
[null,"Capture Volume (Acre-in/yr"]
["WQV","Drainage Area 1","Drainage Area 2","Drainage Area 3","Drainage Area 4"]
[0,0,0,0,0]
[{"$f":"A62+0.01","v":0.01},{"$f":"(B$31*B$32)*(1-(LAMBDA/$A63*B$27)/((LAMBDA/$A63*B$27)+(ZETA/B$21))*((PSI/$A63*B$27)+((ZETA/B$21)*EXP(-$A63*((PSI/$A63*B$27)+(ZETA/B$21)))))/((PSI/$A63*B$27)+(ZETA/B$21))*EXP(-ZETA*B$22))","v":0.6764880388604716},0.6764880388604716,0.6764880388604716,0.6764880388604716]
[{"$f":"A63+0.01","v":0.02},0.800909164273225,0.800909164273225,0.800909164273225,0.800909164273225]
[0.03,0.88859022527489195,0.88859022527489195,0.88859022527489195,0.88859022527489195]
[0.04,0.95119152747556523,0.95119152747556523,0.95119152747556523,0.95119152747556523]
[0.05,0.99654127248122837,0.99654127248122837,0.99654127248122837,0.99654127248122837]
[6.0000000000000005E-2,1.0299210148976656,1.0299210148976656,1.0299210148976656,1.0299210148976656]
[7.0000000000000007E-2,1.0549137987818182,1.0549137987818182,1.0549137987818182,1.0549137987818182]
[0.08,1.0739654063947284,1.0739654063947284,1.0739654063947284,1.0739654063947284]
[0.09,1.0887569062944062,1.0887569062944062,1.0887569062944062,1.0887569062944062]
[9.9999999999999992E-2,1.1004527506596755,1.1004527506596755,1.1004527506596755,1.1004527506596755]
[0.10999999999999999,1.1098665702942871,1.1098665702942871,1.1098665702942871,1.1098665702942871]
[0.11999999999999998,1.1175723863229399,1.1175723863229399,1.1175723863229399,1.1175723863229399]
[0.12999999999999998,1.1239795140584825,1.1239795140584825,1.1239795140584825,1.1239795140584825]
[0.13999999999999999,1.1293832392677248,1.1293832392677248,1.1293832392677248,1.1293832392677248]
[0.15,1.1339992731063742,1.1339992731063742,1.1339992731063742,1.1339992731063742]
[0.16,1.1379873065814095,1.1379873065814095,1.1379873065814095,1.1379873065814095]
[0.17,1.1414672109747166,1.1414672109747166,1.1414672109747166,1.1414672109747166]
[0.18000000000000002,1.1445302552704748,1.1445302552704748,1.1445302552704748,1.1445302552704748]
[0.19000000000000003,1.1472469310364524,1.1472469310364524,1.1472469310364524,1.1472469310364524]
[0.20000000000000004,1.1496724554118118,1.1496724554118118,1.1496724554118118,1.1496724554118118]
[{"$f":"A82+0.01","v":0.21000000000000005},{"$f":"(B$31*B$32)*(1-(LAMBDA/$A83*B$27)/((LAMBDA/$A83*B$27)+(ZETA/B$21))*((PSI/$A83*B$27)+((ZETA/B$21)*EXP(-$A83*((PSI/$A83*B$27)+(ZETA/B$21)))))/((PSI/$A83*B$27)+(ZETA/B$21))*EXP(-ZETA*B$22))","v":1.1518506757357594},1.1518506757357594,1.1518506757357594,1.1518506757357594]
[0.22000000000000006,1.1538168668454891,1.1538168668454891,1.1538168668454891,1.1538168668454891]
[0.23000000000000007,1.1555997558292312,1.1555997558292312,1.1555997558292312,1.1555997558292312]
[0.24000000000000007,1.1572230036574824,1.1572230036574824,1.1572230036574824,1.1572230036574824]
[0.25000000000000006,1.1587063017929513,1.1587063017929513,1.1587063017929513,1.1587063017929513]
[0.26000000000000006,1.1600661933991674,1.1600661933991674,1.1600661933991674,1.1600661933991674]
[0.27000000000000007,1.1613166956639469,1.1613166956639469,1.1613166956639469,1.1613166956639469]
[0.28000000000000008,1.1624697770374612,1.1624697770374612,1.1624697770374612,1.1624697770374612]
[0.29000000000000009,1.1635357275113976,1.1635357275113976,1.1635357275113976,1.1635357275113976]
[0.3000000000000001,1.1645234491876784,1.1645234491876784,1.1645234491876784,1.1645234491876784]
[{"$f":"A92+0.01","v":0.31000000000000011},1.165440686786527,1.165440686786527,1.165440686786527,1.165440686786527]
[0.32000000000000012,1.1662942123985203,1.1662942123985203,1.1662942123985203,1.1662942123985203]
[0.33000000000000013,1.1670899749970169,1.1670899749970169,1.1670899749970169,1.1670899749970169]
[0.34000000000000014,1.167833222520843,1.167833222520843,1.167833222520843,1.167833222520843]
[0.35000000000000014,1.1685286023869803,1.1685286023869803,1.1685286023869803,1.1685286023869803]
[0.36000000000000015,1.1691802448752608,1.1691802448752608,1.1691802448752608,1.1691802448752608]
[0.37000000000000016,1.1697918327868022,1.1697918327868022,1.1697918327868022,1.1697918327868022]
[0.38000000000000017,1.1703666600073312,1.1703666600073312,1.1703666600073312,1.1703666600073312]
[0.39000000000000018,1.1709076810302139,1.1709076810302139,1.1709076810302139,1.1709076810302139]
[{"$f":"A101+0.01","v":0.40000000000000019},1.1714175530587652,1.1714175530587652,1.1714175530587652,1.1714175530587652]
[0.4100000000000002,{"$f":"(B$31*B$32)*(1-(LAMBDA/$A103*B$27)/((LAMBDA/$A103*B$27)+(ZETA/B$21))*((PSI/$A103*B$27)+((ZETA/B$21)*EXP(-$A103*((PSI/$A103*B$27)+(ZETA/B$21)))))/((PSI/$A103*B$27)+(ZETA/B$21))*EXP(-ZETA*B$22))","v":1.1718986719755671},1.1718986719755671,1.1718986719755671,1.1718986719755671]
[0.42000000000000021,1.1723532032111328,1.1723532032111328,1.1723532032111328,1.1723532032111328]
[0.43000000000000022,1.1727831083458964,1.1727831083458964,1.1727831083458964,1.1727831083458964]
[0.44000000000000022,1.1731901681241046,1.1731901681241046,1.1731901681241046,1.1731901681241046]
[0.45000000000000023,1.173576002435418,1.173576002435418,1.173576002435418,1.173576002435418]
[0.46000000000000024,1.1739420877222779,1.1739420877222779,1.1739420877222779,1.1739420877222779]
[0.47000000000000025,1.1742897721926819,1.1742897721926819,1.1742897721926819,1.1742897721926819]
[0.48000000000000026,1.1746202891546851,1.1746202891546851,1.1746202891546851,1.1746202891546851]
[0.49000000000000027,1.1749347687374567,1.1749347687374567,1.1749347687374567,1.1749347687374567]
[0.50000000000000022,1.1752342482216322,1.1752342482216322,1.1752342482216322,1.1752342482216322]
[{"$f":"A112+0.01","v":0.51000000000000023},1.1755196811670729,1.1755196811670729,1.1755196811670729,1.1755196811670729]
[{"$f":"A113+0.01","v":0.52000000000000024},1.175791945497543,1.175791945497543,1.175791945497543,1.175791945497543]
[0.53000000000000025,1.1760518506780384,1.1760518506780384,1.1760518506780384,1.1760518506780384]
[0.54000000000000026,1.1763001441006864,1.1763001441006864,1.1763001441006864,1.1763001441006864]
[0.55000000000000027,1.1765375167785224,1.1765375167785224,1.1765375167785224,1.1765375167785224]
[0.56000000000000028,1.1767646084324836,1.1767646084324836,1.1767646084324836,1.1767646084324836]
[0.57000000000000028,1.1769820120451777,1.1769820120451777,1.1769820120451777,1.1769820120451777]
[0.58000000000000029,1.1771902779449879,1.1771902779449879,1.1771902779449879,1.1771902779449879]
[0.5900000000000003,1.1773899174756057,1.1773899174756057,1.1773899174756057,1.1773899174756057]
[0.60000000000000031,1.1775814062988421,1.1775814062988421,1.1775814062988421,1.1775814062988421]
[0.61000000000000032,{"$f":"(B$31*B$32)*(1-(LAMBDA/$A123*B$27)/((LAMBDA/$A123*B$27)+(ZETA/B$21))*((PSI/$A123*B$27)+((ZETA/B$21)*EXP(-$A123*((PSI/$A123*B$27)+(ZETA/B$21)))))/((PSI/$A123*B$27)+(ZETA/B$21))*EXP(-ZETA*B$22))","v":1.1777651873723916},1.1777651873723916,1.1777651873723916,1.1777651873723916]
[0.62000000000000033,1.177941673638921,1.177941673638921,1.177941673638921,1.177941673638921]
[0.63000000000000034,1.1781112504583067,1.1781112504583067,1.1781112504583067,1.1781112504583067]
[0.64000000000000035,1.178274277810915,1.178274277810915,1.178274277810915,1.178274277810915]
[0.65000000000000036,1.1784310922964321,1.1784310922964321,1.1784310922964321,1.1784310922964321]
[0.66000000000000036,1.1785820089498182,1.1785820089498182,1.1785820089498182,1.1785820089498182]
[0.67000000000000037,1.1787273228934114,1.1787273228934114,1.1787273228934114,1.1787273228934114]
[0.68000000000000038,1.1788673108419914,1.1788673108419914,1.1788673108419914,1.1788673108419914]
[0.69000000000000039,1.1790022324756879,1.1790022324756879,1.1790022324756879,1.1790022324756879]
[0.7000000000000004,1.1791323316939299,1.1791323316939299,1.1791323316939299,1.1791323316939299]
[0.71000000000000041,1.1792578377621563,1.1792578377621563,1.1792578377621563,1.1792578377621563]
[0.72000000000000042,1.179378966361722,1.179378966361722,1.179378966361722,1.179378966361722]
[0.73000000000000043,1.1794959205522904,1.1794959205522904,1.1794959205522904,1.1794959205522904]
[0.74000000000000044,1.1796088916550118,1.1796088916550118,1.1796088916550118,1.1796088916550118]
[0.75000000000000044,1.1797180600639026,1.1797180600639026,1.1797180600639026,1.1797180600639026]
[0.76000000000000045,1.1798235959920638,1.1798235959920638,1.1798235959920638,1.1798235959920638]
[0.77000000000000046,1.1799256601586952,1.1799256601586952,1.1799256601586952,1.1799256601586952]
[0.78000000000000047,1.1800244044222421,1.1800244044222421,1.1800244044222421,1.1800244044222421]
[0.79000000000000048,1.1801199723644864,1.1801199723644864,1.1801199723644864,1.1801199723644864]
[0.80000000000000049,1.1802124998298982,1.1802124998298982,1.1802124998298982,1.1802124998298982]
[0.8100000000000005,{"$f":"(B$31*B$32)*(1-(LAMBDA/$A143*B$27)/((LAMBDA/$A143*B$27)+(ZETA/B$21))*((PSI/$A143*B$27)+((ZETA/B$21)*EXP(-$A143*((PSI/$A143*B$27)+(ZETA/B$21)))))/((PSI/$A143*B$27)+(ZETA/B$21))*EXP(-ZETA*B$22))","v":1.1803021154241542},1.1803021154241542,1.1803021154241542,1.1803021154241542]
[0.82000000000000051,1.1803889409753341,1.1803889409753341,1.1803889409753341,1.1803889409753341]
[0.83000000000000052,1.1804730919609761,1.1804730919609761,1.1804730919609761,1.1804730919609761]
[0.84000000000000052,1.1805546779038656,1.1805546779038656,1.1805546779038656,1.1805546779038656]
[0.85000000000000053,1.1806338027391658,1.1806338027391658,1.1806338027391658,1.1806338027391658]
[0.86000000000000054,1.1807105651552434,1.1807105651552434,1.1807105651552434,1.1807105651552434]
[0.87000000000000055,1.1807850589103419,1.1807850589103419,1.1807850589103419,1.1807850589103419]
[0.88000000000000056,1.180857373127044,1.180857373127044,1.180857373127044,1.180857373127044]
[0.89000000000000057,1.1809275925663001,1.1809275925663001,1.1809275925663001,1.1809275925663001]
[0.90000000000000058,1.1809957978826322,1.1809957978826322,1.1809957978826322,1.1809957978826322]
[0.91000000000000059,1.1810620658619879,1.1810620658619879,1.1810620658619879,1.1810620658619879]
[0.9200000000000006,1.1811264696435853,1.1811264696435853,1.1811264696435853,1.1811264696435853]
[0.9300000000000006,1.1811890789269739,1.1811890789269739,1.1811890789269739,1.1811890789269739]
[0.94000000000000061,1.1812499601654369,1.1812499601654369,1.1812499601654369,1.1812499601654369]
[0.95000000000000062,1.1813091767467534,1.1813091767467534,1.1813091767467534,1.1813091767467534]
[0.96000000000000063,1.1813667891622661,1.1813667891622661,1.1813667891622661,1.1813667891622661]
[0.97000000000000064,1.1814228551651145,1.1814228551651145,1.1814228551651145,1.1814228551651145]
[0.98000000000000065,1.1814774299184205,1.1814774299184205,1.1814774299184205,1.1814774299184205]
[0.99000000000000066,1.1815305661341582,1.1815305661341582,1.1815305661341582,1.1815305661341582]
[1.0000000000000007,1.1815823142033677,1.1815823142033677,1.1815823142033677,1.1815823142033677]
[1.0100000000000007,{"$f":"(B$31*B$32)*(1-(LAMBDA/$A163*B$27)/((LAMBDA/$A163*B$27)+(ZETA/B$21))*((PSI/$A163*B$27)+((ZETA/B$21)*EXP(-$A163*((PSI/$A163*B$27)+(ZETA/B$21)))))/((PSI/$A163*B$27)+(ZETA/B$21))*EXP(-ZETA*B$22))","v":1.1816327223183327},1.1816327223183327,1.1816327223183327,1.1816327223183327]
[1.0200000000000007,1.1816818365872825,1.1816818365872825,1.1816818365872825,1.1816818365872825]
[1.0300000000000007,1.1817297011421424,1.1817297011421424,1.1817297011421424,1.1817297011421424]
[1.0400000000000007,1.1817763582398071,1.1817763582398071,1.1817763582398071,1.1817763582398071]
[1.0500000000000007,1.1818218483573864,1.1818218483573864,1.1818218483573864,1.1818218483573864]
[1.0600000000000007,1.1818662102818251,1.1818662102818251,1.1818662102818251,1.1818662102818251]
[1.0700000000000007,1.1819094811942825,1.1819094811942825,1.1819094811942825,1.1819094811942825]
[1.0800000000000007,1.1819516967496111,1.1819516967496111,1.1819516967496111,1.1819516967496111]
[1.0900000000000007,1.1819928911512685,1.1819928911512685,1.1819928911512685,1.1819928911512685]
[1.1000000000000008,1.1820330972219542,1.1820330972219542,1.1820330972219542,1.1820330972219542]
[1.1100000000000008,1.1820723464702494,1.1820723464702494,1.1820723464702494,1.1820723464702494]
[1.1200000000000008,1.1821106691535239,1.1821106691535239,1.1821106691535239,1.1821106691535239]
[1.1300000000000008,1.1821480943373368,1.1821480943373368,1.1821480943373368,1.1821480943373368]
[1.1400000000000008,1.182184649951566,1.182184649951566,1.182184649951566,1.182184649951566]
[1.1500000000000008,1.1822203628434602,1.1822203628434602,1.1822203628434602,1.1822203628434602]
[{"$f":"A177+0.01","v":1.1600000000000008},1.1822552588278143,1.1822552588278143,1.1822552588278143,1.1822552588278143]
[1.1700000000000008,1.1822893627344404,1.1822893627344404,1.1822893627344404,1.1822893627344404]
[1.1800000000000008,1.1823226984531026,1.1823226984531026,1.1823226984531026,1.1823226984531026]
[1.1900000000000008,1.1823552889760682,1.1823552889760682,1.1823552889760682,1.1823552889760682]
[1.2000000000000008,1.1823871564384227,1.1823871564384227,1.1823871564384227,1.1823871564384227]
[1.2100000000000009,{"$f":"(B$31*B$32)*(1-(LAMBDA/$A183*B$27)/((LAMBDA/$A183*B$27)+(ZETA/B$21))*((PSI/$A183*B$27)+((ZETA/B$21)*EXP(-$A183*((PSI/$A183*B$27)+(ZETA/B$21)))))/((PSI/$A183*B$27)+(ZETA/B$21))*EXP(-ZETA*B$22))","v":1.1824183221562776},1.1824183221562776,1.1824183221562776,1.1824183221562776]
[1.2200000000000009,1.1824488066629988,1.1824488066629988,1.1824488066629988,1.1824488066629988]
[1.2300000000000009,1.1824786297435752,1.1824786297435752,1.1824786297435752,1.1824786297435752]
[1.2400000000000009,1.1825078104672297,1.1825078104672297,1.1825078104672297,1.1825078104672297]
[1.2500000000000009,1.1825363672183806,1.1825363672183806,1.1825363672183806,1.1825363672183806]
[1.2600000000000009,1.1825643177260463,1.1825643177260463,1.1825643177260463,1.1825643177260463]
[1.2700000000000009,1.1825916790917812,1.1825916790917812,1.1825916790917812,1.1825916790917812]
[1.2800000000000009,1.182618467816229,1.182618467816229,1.182618467816229,1.182618467816229]
[1.2900000000000009,1.1826446998243689,1.1826446998243689,1.1826446998243689,1.1826446998243689]
[1.3000000000000009,1.1826703904895295,1.1826703904895295,1.1826703904895295,1.1826703904895295]
[1.3100000000000009,1.1826955546562374,1.1826955546562374,1.1826955546562374,1.1826955546562374]
[1.320000000000001,1.182720206661968,1.182720206661968,1.182720206661968,1.182720206661968]
[1.330000000000001,1.1827443603578522,1.1827443603578522,1.1827443603578522,1.1827443603578522]
[1.340000000000001,1.1827680291284057,1.1827680291284057,1.1827680291284057,1.1827680291284057]
[1.350000000000001,1.1827912259103228,1.1827912259103228,1.1827912259103228,1.1827912259103228]
[1.360000000000001,1.1828139632103931,1.1828139632103931,1.1828139632103931,1.1828139632103931]
[1.370000000000001,1.1828362531225858,1.1828362531225858,1.1828362531225858,1.1828362531225858]
[1.380000000000001,1.1828581073443405,1.1828581073443405,1.1828581073443405,1.1828581073443405]
[1.390000000000001,1.1828795371921161,1.1828795371921161,1.1828795371921161,1.1828795371921161]
[1.400000000000001,1.1829005536162276,1.1829005536162276,1.1829005536162276,1.1829005536162276]
[1.410000000000001,{"$f":"(B$31*B$32)*(1-(LAMBDA/$A203*B$27)/((LAMBDA/$A203*B$27)+(ZETA/B$21))*((PSI/$A203*B$27)+((ZETA/B$21)*EXP(-$A203*((PSI/$A203*B$27)+(ZETA/B$21)))))/((PSI/$A203*B$27)+(ZETA/B$21))*EXP(-ZETA*B$22))","v":1.1829211672150115},1.1829211672150115,1.1829211672150115,1.1829211672150115]
[1.420000000000001,1.1829413882483553,1.1829413882483553,1.1829413882483553,1.1829413882483553]
[1.430000000000001,1.1829612266506211,1.1829612266506211,1.1829612266506211,1.1829612266506211]
[1.4400000000000011,1.1829806920429968,1.1829806920429968,1.1829806920429968,1.1829806920429968]
[1.4500000000000011,1.1829997937453021,1.1829997937453021,1.1829997937453021,1.1829997937453021]
[1.4600000000000011,1.1830185407872758,1.1830185407872758,1.1830185407872758,1.1830185407872758]
[1.4700000000000011,1.1830369419193743,1.1830369419193743,1.1830369419193743,1.1830369419193743]
[1.4800000000000011,1.1830550056230995,1.1830550056230995,1.1830550056230995,1.1830550056230995]
[1.4900000000000011,1.1830727401208863,1.1830727401208863,1.1830727401208863,1.1830727401208863]
[1.5000000000000011,1.1830901533855638,1.1830901533855638,1.1830901533855638,1.1830901533855638]
[1.5100000000000011,1.1831072531494182,1.1831072531494182,1.1831072531494182,1.1831072531494182]
[1.5200000000000011,1.1831240469128705,1.1831240469128705,1.1831240469128705,1.1831240469128705]
[1.5300000000000011,1.1831405419527921,1.1831405419527921,1.1831405419527921,1.1831405419527921]
[1.5400000000000011,1.1831567453304721,1.1831567453304721,1.1831567453304721,1.1831567453304721]
[1.5500000000000012,1.1831726638992561,1.1831726638992561,1.1831726638992561,1.1831726638992561]
[1.5600000000000012,1.1831883043118687,1.1831883043118687,1.1831883043118687,1.1831883043118687]
[1.5700000000000012,1.1832036730274378,1.1832036730274378,1.1832036730274378,1.1832036730274378]
[1.5800000000000012,1.1832187763182316,1.1832187763182316,1.1832187763182316,1.1832187763182316]
[1.5900000000000012,1.1832336202761233,1.1832336202761233,1.1832336202761233,1.1832336202761233]
[1.6000000000000012,1.1832482108187974,1.1832482108187974,1.1832482108187974,1.1832482108187974]
[1.6100000000000012,{"$f":"(B$31*B$32)*(1-(LAMBDA/$A223*B$27)/((LAMBDA/$A223*B$27)+(ZETA/B$21))*((PSI/$A223*B$27)+((ZETA/B$21)*EXP(-$A223*((PSI/$A223*B$27)+(ZETA/B$21)))))/((PSI/$A223*B$27)+(ZETA/B$21))*EXP(-ZETA*B$22))","v":1.1832625536957044},1.1832625536957044,1.1832625536957044,1.1832625536957044]
[1.6200000000000012,1.1832766544937827,1.1832766544937827,1.1832766544937827,1.1832766544937827]
[1.6300000000000012,1.183290518642951,1.183290518642951,1.183290518642951,1.183290518642951]
[1.6400000000000012,1.1833041514213869,1.1833041514213869,1.1833041514213869,1.1833041514213869]
[1.6500000000000012,1.1833175579605981,1.1833175579605981,1.1833175579605981,1.1833175579605981]
[1.6600000000000013,1.1833307432502973,1.1833307432502973,1.1833307432502973,1.1833307432502973]
[1.6700000000000013,1.1833437121430879,1.1833437121430879,1.1833437121430879,1.1833437121430879]
[1.6800000000000013,1.1833564693589704,1.1833564693589704,1.1833564693589704,1.1833564693589704]
[1.6900000000000013,1.1833690194896762,1.1833690194896762,1.1833690194896762,1.1833690194896762]
[1.7000000000000013,1.1833813670028364,1.1833813670028364,1.1833813670028364,1.1833813670028364]
[1.7100000000000013,1.1833935162459939,1.1833935162459939,1.1833935162459939,1.1833935162459939]
[1.7200000000000013,1.1834054714504643,1.1834054714504643,1.1834054714504643,1.1834054714504643]
[1.7300000000000013,1.1834172367350515,1.1834172367350515,1.1834172367350515,1.1834172367350515]
[1.7400000000000013,1.1834288161096271,1.1834288161096271,1.1834288161096271,1.1834288161096271]
[1.7500000000000013,1.1834402134785755,1.1834402134785755,1.1834402134785755,1.1834402134785755]
[1.7600000000000013,1.1834514326441139,1.1834514326441139,1.1834514326441139,1.1834514326441139]
[1.7700000000000014,1.1834624773094888,1.1834624773094888,1.1834624773094888,1.1834624773094888]
[1.7800000000000014,1.1834733510820592,1.1834733510820592,1.1834733510820592,1.1834733510820592]
[1.7900000000000014,1.1834840574762648,1.1834840574762648,1.1834840574762648,1.1834840574762648]
[{"$f":"A241+0.01","v":1.8000000000000014},1.1834945999164892,1.1834945999164892,1.1834945999164892,1.1834945999164892]
[1.8100000000000014,{"$f":"(B$31*B$32)*(1-(LAMBDA/$A243*B$27)/((LAMBDA/$A243*B$27)+(ZETA/B$21))*((PSI/$A243*B$27)+((ZETA/B$21)*EXP(-$A243*((PSI/$A243*B$27)+(ZETA/B$21)))))/((PSI/$A243*B$27)+(ZETA/B$21))*EXP(-ZETA*B$22))","v":1.1835049817398209},1.1835049817398209,1.1835049817398209,1.1835049817398209]
[1.8200000000000014,1.1835152061987146,1.1835152061987146,1.1835152061987146,1.1835152061987146]
[1.8300000000000014,1.1835252764635584,1.1835252764635584,1.1835252764635584,1.1835252764635584]
[1.8400000000000014,1.1835351956251516,1.1835351956251516,1.1835351956251516,1.1835351956251516]
[1.8500000000000014,1.1835449666970941,1.1835449666970941,1.1835449666970941,1.1835449666970941]
[1.8600000000000014,1.1835545926180926,1.1835545926180926,1.1835545926180926,1.1835545926180926]
[1.8700000000000014,1.1835640762541879,1.1835640762541879,1.1835640762541879,1.1835640762541879]
[1.8800000000000014,1.1835734204009039,1.1835734204009039,1.1835734204009039,1.1835734204009039]
[1.8900000000000015,1.1835826277853223,1.1835826277853223,1.1835826277853223,1.1835826277853223]
[1.9000000000000015,1.1835917010680883,1.1835917010680883,1.1835917010680883,1.1835917010680883]
[1.9100000000000015,1.1836006428453461,1.1836006428453461,1.1836006428453461,1.1836006428453461]
[1.9200000000000015,1.1836094556506092,1.1836094556506092,1.1836094556506092,1.1836094556506092]
[1.9300000000000015,1.1836181419565686,1.1836181419565686,1.1836181419565686,1.1836181419565686]
[1.9400000000000015,1.1836267041768389,1.1836267041768389,1.1836267041768389,1.1836267041768389]
[1.9500000000000015,1.183635144667647,1.183635144667647,1.183635144667647,1.183635144667647]
[1.9600000000000015,1.1836434657294643,1.1836434657294643,1.1836434657294643,1.1836434657294643]
[1.9700000000000015,1.1836516696085857,1.1836516696085857,1.1836516696085857,1.1836516696085857]
[1.9800000000000015,1.1836597584986543,1.1836597584986543,1.1836597584986543,1.1836597584986543]
[1.9900000000000015,1.1836677345421402,1.1836677345421402,1.1836677345421402,1.1836677345421402]
[2.0000000000000013,1.1836755998317663,1.1836755998317663,1.1836755998317663,1.1836755998317663]
[2.0100000000000011,{"$f":"(B$31*B$32)*(1-(LAMBDA/$A263*B$27)/((LAMBDA/$A263*B$27)+(ZETA/B$21))*((PSI/$A263*B$27)+((ZETA/B$21)*EXP(-$A263*((PSI/$A263*B$27)+(ZETA/B$21)))))/((PSI/$A263*B$27)+(ZETA/B$21))*EXP(-ZETA*B$22))","v":1.1836833564118914},1.1836833564118914,1.1836833564118914,1.1836833564118914]
[2.0200000000000009,1.1836910062798474,1.1836910062798474,1.1836910062798474,1.1836910062798474]
[2.0300000000000007,1.1836985513872331,1.1836985513872331,1.1836985513872331,1.1836985513872331]
[2.0400000000000005,1.1837059936411671,1.1837059936411671,1.1837059936411671,1.1837059936411671]
[2.0500000000000003,1.1837133349055007,1.1837133349055007,1.1837133349055007,1.1837133349055007]
[2.06,1.1837205770019918,1.1837205770019918,1.1837205770019918,1.1837205770019918]
[2.0699999999999998,1.1837277217114437,1.1837277217114437,1.1837277217114437,1.1837277217114437]
[2.0799999999999996,1.1837347707748049,1.1837347707748049,1.1837347707748049,1.1837347707748049]
[2.0899999999999994,1.1837417258942369,1.1837417258942369,1.1837417258942369,1.1837417258942369]
[2.0999999999999992,1.1837485887341481,1.1837485887341481,1.1837485887341481,1.1837485887341481]
[2.109999999999999,1.1837553609221958,1.1837553609221958,1.1837553609221958,1.1837553609221958]
[2.1199999999999988,1.1837620440502574,1.1837620440502574,1.1837620440502574,1.1837620440502574]
[2.1299999999999986,1.1837686396753699,1.1837686396753699,1.1837686396753699,1.1837686396753699]
[2.1399999999999983,1.1837751493206441,1.1837751493206441,1.1837751493206441,1.1837751493206441]
[2.1499999999999981,1.1837815744761477,1.1837815744761477,1.1837815744761477,1.1837815744761477]
[2.1599999999999979,1.1837879165997645,1.1837879165997645,1.1837879165997645,1.1837879165997645]
[2.1699999999999977,1.1837941771180234,1.1837941771180234,1.1837941771180234,1.1837941771180234]
[2.1799999999999975,1.1838003574269087,1.1838003574269087,1.1838003574269087,1.1838003574269087]
[2.1899999999999973,1.18380645889264,1.18380645889264,1.18380645889264,1.18380645889264]
[2.1999999999999971,1.1838124828524326,1.1838124828524326,1.1838124828524326,1.1838124828524326]
[2.2099999999999969,{"$f":"(B$31*B$32)*(1-(LAMBDA/$A283*B$27)/((LAMBDA/$A283*B$27)+(ZETA/B$21))*((PSI/$A283*B$27)+((ZETA/B$21)*EXP(-$A283*((PSI/$A283*B$27)+(ZETA/B$21)))))/((PSI/$A283*B$27)+(ZETA/B$21))*EXP(-ZETA*B$22))","v":1.1838184306152342},1.1838184306152342,1.1838184306152342,1.1838184306152342]
[2.2199999999999966,1.1838243034624398,1.1838243034624398,1.1838243034624398,1.1838243034624398]
[2.2299999999999964,1.1838301026485853,1.1838301026485853,1.1838301026485853,1.1838301026485853]
[2.2399999999999962,1.1838358294020221,1.1838358294020221,1.1838358294020221,1.1838358294020221]
[2.249999999999996,1.1838414849255698,1.1838414849255698,1.1838414849255698,1.1838414849255698]
[2.2599999999999958,1.183847070397152,1.183847070397152,1.183847070397152,1.183847070397152]
[2.2699999999999956,1.1838525869704124,1.1838525869704124,1.1838525869704124,1.1838525869704124]
[2.2799999999999954,1.183858035775315,1.183858035775315,1.183858035775315,1.183858035775315]
[2.2899999999999952,1.1838634179187233,1.1838634179187233,1.1838634179187233,1.1838634179187233]
[2.2999999999999949,1.1838687344849674,1.1838687344849674,1.1838687344849674,1.1838687344849674]
[2.3099999999999947,1.1838739865363921,1.1838739865363921,1.1838739865363921,1.1838739865363921]
[2.3199999999999945,1.1838791751138906,1.1838791751138906,1.1838791751138906,1.1838791751138906]
[2.3299999999999943,1.1838843012374223,1.1838843012374223,1.1838843012374223,1.1838843012374223]
[2.3399999999999941,1.1838893659065175,1.1838893659065175,1.1838893659065175,1.1838893659065175]
[2.3499999999999939,1.1838943701007658,1.1838943701007658,1.1838943701007658,1.1838943701007658]
[2.3599999999999937,1.1838993147802934,1.1838993147802934,1.1838993147802934,1.1838993147802934]
[2.3699999999999934,1.1839042008862253,1.1839042008862253,1.1839042008862253,1.1839042008862253]
[2.3799999999999932,1.1839090293411347,1.1839090293411347,1.1839090293411347,1.1839090293411347]
[2.389999999999993,1.1839138010494821,1.1839138010494821,1.1839138010494821,1.1839138010494821]
[2.3999999999999928,1.1839185168980391,1.1839185168980391,1.1839185168980391,1.1839185168980391]
[2.4099999999999926,{"$f":"(B$31*B$32)*(1-(LAMBDA/$A303*B$27)/((LAMBDA/$A303*B$27)+(ZETA/B$21))*((PSI/$A303*B$27)+((ZETA/B$21)*EXP(-$A303*((PSI/$A303*B$27)+(ZETA/B$21)))))/((PSI/$A303*B$27)+(ZETA/B$21))*EXP(-ZETA*B$22))","v":1.1839231777563033},1.1839231777563033,1.1839231777563033,1.1839231777563033]
[2.4199999999999924,1.1839277844769018,1.1839277844769018,1.1839277844769018,1.1839277844769018]
[2.4299999999999922,1.1839323378959812,1.1839323378959812,1.1839323378959812,1.1839323378959812]
[{"$f":"A305+0.01","v":2.439999999999992},1.1839368388335896,1.1839368388335896,1.1839368388335896,1.1839368388335896]
[2.4499999999999917,1.1839412880940481,1.1839412880940481,1.1839412880940481,1.1839412880940481]
[2.4599999999999915,1.1839456864663109,1.1839456864663109,1.1839456864663109,1.1839456864663109]
[2.4699999999999913,1.1839500347243168,1.1839500347243168,1.1839500347243168,1.1839500347243168]
[2.4799999999999911,1.1839543336273317,1.1839543336273317,1.1839543336273317,1.1839543336273317]
[2.4899999999999909,1.1839585839202804,1.1839585839202804,1.1839585839202804,1.1839585839202804]
[2.4999999999999907,1.1839627863340727,1.1839627863340727,1.1839627863340727,1.1839627863340727]
[2.5099999999999905,1.1839669415859169,1.1839669415859169,1.1839669415859169,1.1839669415859169]
[2.5199999999999902,1.1839710503796281,1.1839710503796281,1.1839710503796281,1.1839710503796281]
[2.52999999999999,1.183975113405928,1.183975113405928,1.183975113405928,1.183975113405928]
[2.5399999999999898,1.1839791313427355,1.1839791313427355,1.1839791313427355,1.1839791313427355]
[2.5499999999999896,1.1839831048554512,1.1839831048554512,1.1839831048554512,1.1839831048554512]
[2.5599999999999894,1.1839870345972339,1.1839870345972339,1.1839870345972339,1.1839870345972339]
[2.5699999999999892,1.1839909212092701,1.1839909212092701,1.1839909212092701,1.1839909212092701]
[2.579999999999989,1.1839947653210368,1.1839947653210368,1.1839947653210368,1.1839947653210368]
[2.5899999999999888,1.1839985675505578,1.1839985675505578,1.1839985675505578,1.1839985675505578]
[2.5999999999999885,1.1840023285046519,1.1840023285046519,1.1840023285046519,1.1840023285046519]
[2.6099999999999883,{"$f":"(B$31*B$32)*(1-(LAMBDA/$A323*B$27)/((LAMBDA/$A323*B$27)+(ZETA/B$21))*((PSI/$A323*B$27)+((ZETA/B$21)*EXP(-$A323*((PSI/$A323*B$27)+(ZETA/B$21)))))/((PSI/$A323*B$27)+(ZETA/B$21))*EXP(-ZETA*B$22))","v":1.1840060487791777},1.1840060487791777,1.1840060487791777,1.1840060487791777]
[2.6199999999999881,1.1840097289592686,1.1840097289592686,1.1840097289592686,1.1840097289592686]
[2.6299999999999879,1.1840133696195656,1.1840133696195656,1.1840133696195656,1.1840133696195656]
[2.6399999999999877,1.1840169713244417,1.1840169713244417,1.1840169713244417,1.1840169713244417]
[2.6499999999999875,1.1840205346282215,1.1840205346282215,1.1840205346282215,1.1840205346282215]
[2.6599999999999873,1.1840240600753953,1.1840240600753953,1.1840240600753953,1.1840240600753953]
[2.6699999999999871,1.1840275482008278,1.1840275482008278,1.1840275482008278,1.1840275482008278]
[2.6799999999999868,1.1840309995299623,1.1840309995299623,1.1840309995299623,1.1840309995299623]
[2.6899999999999866,1.1840344145790191,1.1840344145790191,1.1840344145790191,1.1840344145790191]
[2.6999999999999864,1.1840377938551889,1.1840377938551889,1.1840377938551889,1.1840377938551889]
[2.7099999999999862,1.1840411378568223,1.1840411378568223,1.1840411378568223,1.1840411378568223]
[2.719999999999986,1.1840444470736138,1.1840444470736138,1.1840444470736138,1.1840444470736138]
[2.7299999999999858,1.1840477219867818,1.1840477219867818,1.1840477219867818,1.1840477219867818]
[2.7399999999999856,1.1840509630692453,1.1840509630692453,1.1840509630692453,1.1840509630692453]
[2.7499999999999853,1.1840541707857934,1.1840541707857934,1.1840541707857934,1.1840541707857934]
[2.7599999999999851,1.1840573455932539,1.1840573455932539,1.1840573455932539,1.1840573455932539]
[2.7699999999999849,1.1840604879406562,1.1840604879406562,1.1840604879406562,1.1840604879406562]
[2.7799999999999847,1.1840635982693903,1.1840635982693903,1.1840635982693903,1.1840635982693903]
[2.7899999999999845,1.1840666770133628,1.1840666770133628,1.1840666770133628,1.1840666770133628]
[2.7999999999999843,1.1840697245991485,1.1840697245991485,1.1840697245991485,1.1840697245991485]
[2.8099999999999841,{"$f":"(B$31*B$32)*(1-(LAMBDA/$A343*B$27)/((LAMBDA/$A343*B$27)+(ZETA/B$21))*((PSI/$A343*B$27)+((ZETA/B$21)*EXP(-$A343*((PSI/$A343*B$27)+(ZETA/B$21)))))/((PSI/$A343*B$27)+(ZETA/B$21))*EXP(-ZETA*B$22))","v":1.1840727414461389},1.1840727414461389,1.1840727414461389,1.1840727414461389]
[2.8199999999999839,1.1840757279666871,1.1840757279666871,1.1840757279666871,1.1840757279666871]
[2.8299999999999836,1.1840786845662485,1.1840786845662485,1.1840786845662485,1.1840786845662485]
[2.8399999999999834,1.1840816116435195,1.1840816116435195,1.1840816116435195,1.1840816116435195]
[2.8499999999999832,1.184084509590573,1.184084509590573,1.184084509590573,1.184084509590573]
[2.859999999999983,1.1840873787929882,1.1840873787929882,1.1840873787929882,1.1840873787929882]
[2.8699999999999828,1.1840902196299814,1.1840902196299814,1.1840902196299814,1.1840902196299814]
[2.8799999999999826,1.1840930324745305,1.1840930324745305,1.1840930324745305,1.1840930324745305]
[2.8899999999999824,1.1840958176934979,1.1840958176934979,1.1840958176934979,1.1840958176934979]
[2.8999999999999821,1.1840985756477513,1.1840985756477513,1.1840985756477513,1.1840985756477513]
[2.9099999999999819,1.1841013066922799,1.1841013066922799,1.1841013066922799,1.1841013066922799]
[2.9199999999999817,1.1841040111763104,1.1841040111763104,1.1841040111763104,1.1841040111763104]
[2.9299999999999815,1.1841066894434169,1.1841066894434169,1.1841066894434169,1.1841066894434169]
[2.9399999999999813,1.1841093418316329,1.1841093418316329,1.1841093418316329,1.1841093418316329]
[2.9499999999999811,1.1841119686735562,1.1841119686735562,1.1841119686735562,1.1841119686735562]
[2.9599999999999809,1.1841145702964546,1.1841145702964546,1.1841145702964546,1.1841145702964546]
[2.9699999999999807,1.1841171470223681,1.1841171470223681,1.1841171470223681,1.1841171470223681]
[2.9799999999999804,1.1841196991682088,1.1841196991682088,1.1841196991682088,1.1841196991682088]
[2.9899999999999802,1.184122227045858,1.184122227045858,1.184122227045858,1.184122227045858]
[2.99999999999998,1.1841247309622625,1.1841247309622625,1.1841247309622625,1.1841247309622625]
[3.0099999999999798,{"$f":"(B$31*B$32)*(1-(LAMBDA/$A363*B$27)/((LAMBDA/$A363*B$27)+(ZETA/B$21))*((PSI/$A363*B$27)+((ZETA/B$21)*EXP(-$A363*((PSI/$A363*B$27)+(ZETA/B$21)))))/((PSI/$A363*B$27)+(ZETA/B$21))*EXP(-ZETA*B$22))","v":1.1841272112195282},1.1841272112195282,1.1841272112195282,1.1841272112195282]
[3.0199999999999796,1.1841296681150109,1.1841296681150109,1.1841296681150109,1.1841296681150109]
[3.0299999999999794,1.1841321019414057,1.1841321019414057,1.1841321019414057,1.1841321019414057]
[3.0399999999999792,1.1841345129868357,1.1841345129868357,1.1841345129868357,1.1841345129868357]
[3.049999999999979,1.1841369015349354,1.1841369015349354,1.1841369015349354,1.1841369015349354]
[3.0599999999999787,1.1841392678649367,1.1841392678649367,1.1841392678649367,1.1841392678649367]
[3.0699999999999785,1.1841416122517485,1.1841416122517485,1.1841416122517485,1.1841416122517485]
[{"$f":"A369+0.01","v":3.0799999999999783},1.1841439349660385,1.1841439349660385,1.1841439349660385,1.1841439349660385]
[3.0899999999999781,1.1841462362743107,1.1841462362743107,1.1841462362743107,1.1841462362743107]
[3.0999999999999779,1.1841485164389824,1.1841485164389824,1.1841485164389824,1.1841485164389824]
[3.1099999999999777,1.1841507757184593,1.1841507757184593,1.1841507757184593,1.1841507757184593]
[3.1199999999999775,1.1841530143672081,1.1841530143672081,1.1841530143672081,1.1841530143672081]
[3.1299999999999772,1.1841552326358296,1.1841552326358296,1.1841552326358296,1.1841552326358296]
[3.139999999999977,1.1841574307711282,1.1841574307711282,1.1841574307711282,1.1841574307711282]
[3.1499999999999768,1.1841596090161814,1.1841596090161814,1.1841596090161814,1.1841596090161814]
[3.1599999999999766,1.1841617676104059,1.1841617676104059,1.1841617676104059,1.1841617676104059]
[3.1699999999999764,1.1841639067896257,1.1841639067896257,1.1841639067896257,1.1841639067896257]
[3.1799999999999762,1.184166026786134,1.184166026786134,1.184166026786134,1.184166026786134]
[3.189999999999976,1.184168127828759,1.184168127828759,1.184168127828759,1.184168127828759]
[3.1999999999999758,1.1841702101429243,1.1841702101429243,1.1841702101429243,1.1841702101429243]
[3.2099999999999755,{"$f":"(B$31*B$32)*(1-(LAMBDA/$A383*B$27)/((LAMBDA/$A383*B$27)+(ZETA/B$21))*((PSI/$A383*B$27)+((ZETA/B$21)*EXP(-$A383*((PSI/$A383*B$27)+(ZETA/B$21)))))/((PSI/$A383*B$27)+(ZETA/B$21))*EXP(-ZETA*B$22))","v":1.1841722739507097},1.1841722739507097,1.1841722739507097,1.1841722739507097]
[3.2199999999999753,1.1841743194709113,1.1841743194709113,1.1841743194709113,1.1841743194709113]
[3.2299999999999751,1.1841763469190987,1.1841763469190987,1.1841763469190987,1.1841763469190987]
[3.2399999999999749,1.1841783565076729,1.1841783565076729,1.1841783565076729,1.1841783565076729]
[3.2499999999999747,1.184180348445921,1.184180348445921,1.184180348445921,1.184180348445921]
[3.2599999999999745,1.1841823229400716,1.1841823229400716,1.1841823229400716,1.1841823229400716]
[3.2699999999999743,1.1841842801933486,1.1841842801933486,1.1841842801933486,1.1841842801933486]
[3.279999999999974,1.1841862204060225,1.1841862204060225,1.1841862204060225,1.1841862204060225]
[3.2899999999999738,1.1841881437754629,1.1841881437754629,1.1841881437754629,1.1841881437754629]
[3.2999999999999736,1.184190050496188,1.184190050496188,1.184190050496188,1.184190050496188]
[3.3099999999999734,1.1841919407599146,1.1841919407599146,1.1841919407599146,1.1841919407599146]
[3.3199999999999732,1.1841938147556059,1.1841938147556059,1.1841938147556059,1.1841938147556059]
[3.329999999999973,1.1841956726695191,1.1841956726695191,1.1841956726695191,1.1841956726695191]
[3.3399999999999728,1.1841975146852517,1.1841975146852517,1.1841975146852517,1.1841975146852517]
[3.3499999999999726,1.184199340983787,1.184199340983787,1.184199340983787,1.184199340983787]
[3.3599999999999723,1.1842011517435385,1.1842011517435385,1.1842011517435385,1.1842011517435385]
[3.3699999999999721,1.1842029471403941,1.1842029471403941,1.1842029471403941,1.1842029471403941]
[3.3799999999999719,1.1842047273477585,1.1842047273477585,1.1842047273477585,1.1842047273477585]
[3.3899999999999717,1.1842064925365952,1.1842064925365952,1.1842064925365952,1.1842064925365952]
[3.3999999999999715,1.184208242875467,1.184208242875467,1.184208242875467,1.184208242875467]
[3.4099999999999713,{"$f":"(B$31*B$32)*(1-(LAMBDA/$A403*B$27)/((LAMBDA/$A403*B$27)+(ZETA/B$21))*((PSI/$A403*B$27)+((ZETA/B$21)*EXP(-$A403*((PSI/$A403*B$27)+(ZETA/B$21)))))/((PSI/$A403*B$27)+(ZETA/B$21))*EXP(-ZETA*B$22))","v":1.1842099785305784},1.1842099785305784,1.1842099785305784,1.1842099785305784]
[3.4199999999999711,1.1842116996658127,1.1842116996658127,1.1842116996658127,1.1842116996658127]
[3.4299999999999708,1.1842134064427723,1.1842134064427723,1.1842134064427723,1.1842134064427723]
[3.4399999999999706,1.1842150990208162,1.1842150990208162,1.1842150990208162,1.1842150990208162]
[3.4499999999999704,1.1842167775570973,1.1842167775570973,1.1842167775570973,1.1842167775570973]
[3.4599999999999702,1.1842184422065993,1.1842184422065993,1.1842184422065993,1.1842184422065993]
[3.46999999999997,1.1842200931221722,1.1842200931221722,1.1842200931221722,1.1842200931221722]
[3.4799999999999698,1.1842217304545672,1.1842217304545672,1.1842217304545672,1.1842217304545672]
[3.4899999999999696,1.1842233543524721,1.1842233543524721,1.1842233543524721,1.1842233543524721]
[3.4999999999999694,1.1842249649625445,1.1842249649625445,1.1842249649625445,1.1842249649625445]
[3.5099999999999691,1.1842265624294446,1.1842265624294446,1.1842265624294446,1.1842265624294446]
[3.5199999999999689,1.1842281468958689,1.1842281468958689,1.1842281468958689,1.1842281468958689]
[3.5299999999999687,1.184229718502581,1.184229718502581,1.184229718502581,1.184229718502581]
[3.5399999999999685,1.1842312773884438,1.1842312773884438,1.1842312773884438,1.1842312773884438]
[3.5499999999999683,1.1842328236904496,1.1842328236904496,1.1842328236904496,1.1842328236904496]
[3.5599999999999681,1.1842343575437508,1.1842343575437508,1.1842343575437508,1.1842343575437508]
[3.5699999999999679,1.1842358790816891,1.1842358790816891,1.1842358790816891,1.1842358790816891]
[3.5799999999999677,1.1842373884358246,1.1842373884358246,1.1842373884358246,1.1842373884358246]
[3.5899999999999674,1.1842388857359643,1.1842388857359643,1.1842388857359643,1.1842388857359643]
[3.5999999999999672,1.1842403711101903,1.1842403711101903,1.1842403711101903,1.1842403711101903]
[3.609999999999967,{"$f":"(B$31*B$32)*(1-(LAMBDA/$A423*B$27)/((LAMBDA/$A423*B$27)+(ZETA/B$21))*((PSI/$A423*B$27)+((ZETA/B$21)*EXP(-$A423*((PSI/$A423*B$27)+(ZETA/B$21)))))/((PSI/$A423*B$27)+(ZETA/B$21))*EXP(-ZETA*B$22))","v":1.1842418446848872},1.1842418446848872,1.1842418446848872,1.1842418446848872]
[3.6199999999999668,1.1842433065847686,1.1842433065847686,1.1842433065847686,1.1842433065847686]
[3.6299999999999666,1.1842447569329047,1.1842447569329047,1.1842447569329047,1.1842447569329047]
[3.6399999999999664,1.184246195850746,1.184246195850746,1.184246195850746,1.184246195850746]
[3.6499999999999662,1.1842476234581516,1.1842476234581516,1.1842476234581516,1.1842476234581516]
[3.6599999999999659,1.1842490398734125,1.1842490398734125,1.1842490398734125,1.1842490398734125]
[3.6699999999999657,1.1842504452132758,1.1842504452132758,1.1842504452132758,1.1842504452132758]
[3.6799999999999655,1.1842518395929704,1.1842518395929704,1.1842518395929704,1.1842518395929704]
[3.6899999999999653,1.1842532231262293,1.1842532231262293,1.1842532231262293,1.1842532231262293]
[3.6999999999999651,1.1842545959253135,1.1842545959253135,1.1842545959253135,1.1842545959253135]
[3.7099999999999649,1.1842559581010343,1.1842559581010343,1.1842559581010343,1.1842559581010343]
[{"$f":"A433+0.01","v":3.7199999999999647},1.1842573097627767,1.1842573097627767,1.1842573097627767,1.1842573097627767]
[3.7299999999999645,1.18425865101852,1.18425865101852,1.18425865101852,1.18425865101852]
[3.7399999999999642,1.1842599819748607,1.1842599819748607,1.1842599819748607,1.1842599819748607]
[3.749999999999964,1.1842613027370328,1.1842613027370328,1.1842613027370328,1.1842613027370328]
[3.7599999999999638,1.1842626134089296,1.1842626134089296,1.1842626134089296,1.1842626134089296]
[3.7699999999999636,1.1842639140931226,1.1842639140931226,1.1842639140931226,1.1842639140931226]
[3.7799999999999634,1.1842652048908837,1.1842652048908837,1.1842652048908837,1.1842652048908837]
[3.7899999999999632,1.1842664859022032,1.1842664859022032,1.1842664859022032,1.1842664859022032]
[3.799999999999963,1.18426775722581,1.18426775722581,1.18426775722581,1.18426775722581]
[3.8099999999999627,{"$f":"(B$31*B$32)*(1-(LAMBDA/$A443*B$27)/((LAMBDA/$A443*B$27)+(ZETA/B$21))*((PSI/$A443*B$27)+((ZETA/B$21)*EXP(-$A443*((PSI/$A443*B$27)+(ZETA/B$21)))))/((PSI/$A443*B$27)+(ZETA/B$21))*EXP(-ZETA*B$22))","v":1.1842690189591907},1.1842690189591907,1.1842690189591907,1.1842690189591907]
[3.8199999999999625,1.1842702711986077,1.1842702711986077,1.1842702711986077,1.1842702711986077]
[3.8299999999999623,1.1842715140391187,1.1842715140391187,1.1842715140391187,1.1842715140391187]
[3.8399999999999621,1.1842727475745936,1.1842727475745936,1.1842727475745936,1.1842727475745936]
[3.8499999999999619,1.1842739718977326,1.1842739718977326,1.1842739718977326,1.1842739718977326]
[3.8599999999999617,1.1842751871000847,1.1842751871000847,1.1842751871000847,1.1842751871000847]
[3.8699999999999615,1.1842763932720632,1.1842763932720632,1.1842763932720632,1.1842763932720632]
[3.8799999999999613,1.1842775905029637,1.1842775905029637,1.1842775905029637,1.1842775905029637]
[3.889999999999961,1.1842787788809799,1.1842787788809799,1.1842787788809799,1.1842787788809799]
[3.8999999999999608,1.1842799584932207,1.1842799584932207,1.1842799584932207,1.1842799584932207]
[3.9099999999999606,1.1842811294257252,1.1842811294257252,1.1842811294257252,1.1842811294257252]
[3.9199999999999604,1.1842822917634799,1.1842822917634799,1.1842822917634799,1.1842822917634799]
[3.9299999999999602,1.1842834455904321,1.1842834455904321,1.1842834455904321,1.1842834455904321]
[3.93999999999996,1.1842845909895068,1.1842845909895068,1.1842845909895068,1.1842845909895068]
[3.9499999999999598,1.1842857280426213,1.1842857280426213,1.1842857280426213,1.1842857280426213]
[3.9599999999999596,1.1842868568306988,1.1842868568306988,1.1842868568306988,1.1842868568306988]
[3.9699999999999593,1.1842879774336845,1.1842879774336845,1.1842879774336845,1.1842879774336845]
[3.9799999999999591,1.1842890899305583,1.1842890899305583,1.1842890899305583,1.1842890899305583]
[3.9899999999999589,1.1842901943993493,1.1842901943993493,1.1842901943993493,1.1842901943993493]
[3.9999999999999587,1.1842912909171504,1.1842912909171504,1.1842912909171504,1.1842912909171504]
[4.0099999999999589,{"$f":"(B$31*B$32)*(1-(LAMBDA/$A463*B$27)/((LAMBDA/$A463*B$27)+(ZETA/B$21))*((PSI/$A463*B$27)+((ZETA/B$21)*EXP(-$A463*((PSI/$A463*B$27)+(ZETA/B$21)))))/((PSI/$A463*B$27)+(ZETA/B$21))*EXP(-ZETA*B$22))","v":1.1842923795601299},1.1842923795601299,1.1842923795601299,1.1842923795601299]
[4.0199999999999587,1.1842934604035462,1.1842934604035462,1.1842934604035462,1.1842934604035462]
[4.0299999999999585,1.1842945335217605,1.1842945335217605,1.1842945335217605,1.1842945335217605]
[4.0399999999999583,1.1842955989882495,1.1842955989882495,1.1842955989882495,1.1842955989882495]
[4.0499999999999581,1.1842966568756181,1.1842966568756181,1.1842966568756181,1.1842966568756181]
[4.0599999999999579,1.1842977072556113,1.1842977072556113,1.1842977072556113,1.1842977072556113]
[4.0699999999999577,1.1842987501991273,1.1842987501991273,1.1842987501991273,1.1842987501991273]
[4.0799999999999574,1.184299785776229,1.184299785776229,1.184299785776229,1.184299785776229]
[4.0899999999999572,1.1843008140561551,1.1843008140561551,1.1843008140561551,1.1843008140561551]
[4.099999999999957,1.1843018351073329,1.1843018351073329,1.1843018351073329,1.1843018351073329]
[4.1099999999999568,1.1843028489973895,1.1843028489973895,1.1843028489973895,1.1843028489973895]
[4.1199999999999566,1.184303855793162,1.184303855793162,1.184303855793162,1.184303855793162]
[4.1299999999999564,1.1843048555607096,1.1843048555607096,1.1843048555607096,1.1843048555607096]
[4.1399999999999562,1.1843058483653239,1.1843058483653239,1.1843058483653239,1.1843058483653239]
[4.1499999999999559,1.1843068342715399,1.1843068342715399,1.1843068342715399,1.1843068342715399]
[4.1599999999999557,1.1843078133431462,1.1843078133431462,1.1843078133431462,1.1843078133431462]
[4.1699999999999555,1.184308785643196,1.184308785643196,1.184308785643196,1.184308785643196]
[4.1799999999999553,1.1843097512340157,1.1843097512340157,1.1843097512340157,1.1843097512340157]
[4.1899999999999551,1.184310710177217,1.184310710177217,1.184310710177217,1.184310710177217]
[4.1999999999999549,1.1843116625337053,1.1843116625337053,1.1843116625337053,1.1843116625337053]
[4.2099999999999547,{"$f":"(B$31*B$32)*(1-(LAMBDA/$A483*B$27)/((LAMBDA/$A483*B$27)+(ZETA/B$21))*((PSI/$A483*B$27)+((ZETA/B$21)*EXP(-$A483*((PSI/$A483*B$27)+(ZETA/B$21)))))/((PSI/$A483*B$27)+(ZETA/B$21))*EXP(-ZETA*B$22))","v":1.1843126083636901},1.1843126083636901,1.1843126083636901,1.1843126083636901]
[4.2199999999999545,1.1843135477266937,1.1843135477266937,1.1843135477266937,1.1843135477266937]
[4.2299999999999542,1.1843144806815611,1.1843144806815611,1.1843144806815611,1.1843144806815611]
[4.239999999999954,1.1843154072864701,1.1843154072864701,1.1843154072864701,1.1843154072864701]
[4.2499999999999538,1.1843163275989383,1.1843163275989383,1.1843163275989383,1.1843163275989383]
[4.2599999999999536,1.1843172416758345,1.1843172416758345,1.1843172416758345,1.1843172416758345]
[4.2699999999999534,1.1843181495733854,1.1843181495733854,1.1843181495733854,1.1843181495733854]
[4.2799999999999532,1.1843190513471855,1.1843190513471855,1.1843190513471855,1.1843190513471855]
[4.289999999999953,1.184319947052205,1.184319947052205,1.184319947052205,1.184319947052205]
[4.2999999999999527,1.1843208367427984,1.1843208367427984,1.1843208367427984,1.1843208367427984]
[4.3099999999999525,1.1843217204727134,1.1843217204727134,1.1843217204727134,1.1843217204727134]
[4.3199999999999523,1.1843225982950978,1.1843225982950978,1.1843225982950978,1.1843225982950978]
[4.3299999999999521,1.1843234702625083,1.1843234702625083,1.1843234702625083,1.1843234702625083]
[4.3399999999999519,1.1843243364269185,1.1843243364269185,1.1843243364269185,1.1843243364269185]
[4.3499999999999517,1.1843251968397257,1.1843251968397257,1.1843251968397257,1.1843251968397257]
[{"$f":"A497+0.01","v":4.3599999999999515},1.18432605155176,1.18432605155176,1.18432605155176,1.18432605155176]
[4.3699999999999513,1.1843269006132904,1.1843269006132904,1.1843269006132904,1.1843269006132904]
[4.379999999999951,1.184327744074033,1.184327744074033,1.184327744074033,1.184327744074033]
[4.3899999999999508,1.1843285819831586,1.1843285819831586,1.1843285819831586,1.1843285819831586]
[4.3999999999999506,1.1843294143892986,1.1843294143892986,1.1843294143892986,1.1843294143892986]
[4.4099999999999504,{"$f":"(B$31*B$32)*(1-(LAMBDA/$A503*B$27)/((LAMBDA/$A503*B$27)+(ZETA/B$21))*((PSI/$A503*B$27)+((ZETA/B$21)*EXP(-$A503*((PSI/$A503*B$27)+(ZETA/B$21)))))/((PSI/$A503*B$27)+(ZETA/B$21))*EXP(-ZETA*B$22))","v":1.1843302413405532},1.1843302413405532,1.1843302413405532,1.1843302413405532]
[4.4199999999999502,1.1843310628844981,1.1843310628844981,1.1843310628844981,1.1843310628844981]
[4.42999999999995,1.1843318790681914,1.1843318790681914,1.1843318790681914,1.1843318790681914]
[4.4399999999999498,1.1843326899381799,1.1843326899381799,1.1843326899381799,1.1843326899381799]
[4.4499999999999496,1.184333495540506,1.184333495540506,1.184333495540506,1.184333495540506]
[4.4599999999999493,1.1843342959207148,1.1843342959207148,1.1843342959207148,1.1843342959207148]
[4.4699999999999491,1.1843350911238597,1.1843350911238597,1.1843350911238597,1.1843350911238597]
[4.4799999999999489,1.1843358811945088,1.1843358811945088,1.1843358811945088,1.1843358811945088]
[4.4899999999999487,1.1843366661767525,1.1843366661767525,1.1843366661767525,1.1843366661767525]
[4.4999999999999485,1.1843374461142073,1.1843374461142073,1.1843374461142073,1.1843374461142073]
[4.5099999999999483,1.1843382210500242,1.1843382210500242,1.1843382210500242,1.1843382210500242]
[4.5199999999999481,1.1843389910268929,1.1843389910268929,1.1843389910268929,1.1843389910268929]
[4.5299999999999478,1.1843397560870492,1.1843397560870492,1.1843397560870492,1.1843397560870492]
[4.5399999999999476,1.1843405162722798,1.1843405162722798,1.1843405162722798,1.1843405162722798]
[4.5499999999999474,1.1843412716239277,1.1843412716239277,1.1843412716239277,1.1843412716239277]
[4.5599999999999472,1.1843420221828991,1.1843420221828991,1.1843420221828991,1.1843420221828991]
[4.569999999999947,1.1843427679896679,1.1843427679896679,1.1843427679896679,1.1843427679896679]
[4.5799999999999468,1.1843435090842818,1.1843435090842818,1.1843435090842818,1.1843435090842818]
[4.5899999999999466,1.1843442455063669,1.1843442455063669,1.1843442455063669,1.1843442455063669]
[4.5999999999999464,1.184344977295134,1.184344977295134,1.184344977295134,1.184344977295134]
[4.6099999999999461,{"$f":"(B$31*B$32)*(1-(LAMBDA/$A523*B$27)/((LAMBDA/$A523*B$27)+(ZETA/B$21))*((PSI/$A523*B$27)+((ZETA/B$21)*EXP(-$A523*((PSI/$A523*B$27)+(ZETA/B$21)))))/((PSI/$A523*B$27)+(ZETA/B$21))*EXP(-ZETA*B$22))","v":1.184345704489383},1.184345704489383,1.184345704489383,1.184345704489383]
[4.6199999999999459,1.1843464271275084,1.1843464271275084,1.1843464271275084,1.1843464271275084]
[4.6299999999999457,1.1843471452475047,1.1843471452475047,1.1843471452475047,1.1843471452475047]
[4.6399999999999455,1.1843478588869703,1.1843478588869703,1.1843478588869703,1.1843478588869703]
[4.6499999999999453,1.1843485680831138,1.1843485680831138,1.1843485680831138,1.1843485680831138]
[4.6599999999999451,1.184349272872758,1.184349272872758,1.184349272872758,1.184349272872758]
[4.6699999999999449,1.1843499732923453,1.1843499732923453,1.1843499732923453,1.1843499732923453]
[4.6799999999999446,1.1843506693779413,1.1843506693779413,1.1843506693779413,1.1843506693779413]
[4.6899999999999444,1.1843513611652408,1.1843513611652408,1.1843513611652408,1.1843513611652408]
[4.6999999999999442,1.1843520486895711,1.1843520486895711,1.1843520486895711,1.1843520486895711]
[4.709999999999944,1.1843527319858984,1.1843527319858984,1.1843527319858984,1.1843527319858984]
[4.7199999999999438,1.1843534110888296,1.1843534110888296,1.1843534110888296,1.1843534110888296]
[4.7299999999999436,1.1843540860326192,1.1843540860326192,1.1843540860326192,1.1843540860326192]
[4.7399999999999434,1.1843547568511716,1.1843547568511716,1.1843547568511716,1.1843547568511716]
[4.7499999999999432,1.1843554235780474,1.1843554235780474,1.1843554235780474,1.1843554235780474]
[4.7599999999999429,1.1843560862464653,1.1843560862464653,1.1843560862464653,1.1843560862464653]
[4.7699999999999427,1.1843567448893086,1.1843567448893086,1.1843567448893086,1.1843567448893086]
[4.7799999999999425,1.1843573995391277,1.1843573995391277,1.1843573995391277,1.1843573995391277]
[4.7899999999999423,1.1843580502281439,1.1843580502281439,1.1843580502281439,1.1843580502281439]
[4.7999999999999421,1.1843586969882551,1.1843586969882551,1.1843586969882551,1.1843586969882551]
[4.8099999999999419,{"$f":"(B$31*B$32)*(1-(LAMBDA/$A543*B$27)/((LAMBDA/$A543*B$27)+(ZETA/B$21))*((PSI/$A543*B$27)+((ZETA/B$21)*EXP(-$A543*((PSI/$A543*B$27)+(ZETA/B$21)))))/((PSI/$A543*B$27)+(ZETA/B$21))*EXP(-ZETA*B$22))","v":1.1843593398510379},1.1843593398510379,1.1843593398510379,1.1843593398510379]
[4.8199999999999417,1.1843599788477526,1.1843599788477526,1.1843599788477526,1.1843599788477526]
[4.8299999999999415,1.1843606140093466,1.1843606140093466,1.1843606140093466,1.1843606140093466]
[4.8399999999999412,1.1843612453664578,1.1843612453664578,1.1843612453664578,1.1843612453664578]
[4.849999999999941,1.1843618729494192,1.1843618729494192,1.1843618729494192,1.1843618729494192]
[4.8599999999999408,1.1843624967882616,1.1843624967882616,1.1843624967882616,1.1843624967882616]
[4.8699999999999406,1.1843631169127173,1.1843631169127173,1.1843631169127173,1.1843631169127173]
[4.8799999999999404,1.1843637333522252,1.1843637333522252,1.1843637333522252,1.1843637333522252]
[4.8899999999999402,1.1843643461359314,1.1843643461359314,1.1843643461359314,1.1843643461359314]
[4.89999999999994,1.184364955292696,1.184364955292696,1.184364955292696,1.184364955292696]
[4.9099999999999397,1.1843655608510932,1.1843655608510932,1.1843655608510932,1.1843655608510932]
[4.9199999999999395,1.1843661628394175,1.1843661628394175,1.1843661628394175,1.1843661628394175]
[4.9299999999999393,1.1843667612856852,1.1843667612856852,1.1843667612856852,1.1843667612856852]
[4.9399999999999391,1.184367356217638,1.184367356217638,1.184367356217638,1.184367356217638]
[4.9499999999999389,1.1843679476627469,1.1843679476627469,1.1843679476627469,1.1843679476627469]
[4.9599999999999387,1.184368535648215,1.184368535648215,1.184368535648215,1.184368535648215]
[4.9699999999999385,1.1843691202009801,1.1843691202009801,1.1843691202009801,1.1843691202009801]
[4.9799999999999383,1.1843697013477188,1.1843697013477188,1.1843697013477188,1.1843697013477188]
[4.989999999999938,1.1843702791148483,1.1843702791148483,1.1843702791148483,1.1843702791148483]
[{"$f":"A561+0.01","v":4.9999999999999378},1.1843708535285307,1.1843708535285307,1.1843708535285307,1.1843708535285307]
[5.0099999999999376,{"$f":"(B$31*B$32)*(1-(LAMBDA/$A563*B$27)/((LAMBDA/$A563*B$27)+(ZETA/B$21))*((PSI/$A563*B$27)+((ZETA/B$21)*EXP(-$A563*((PSI/$A563*B$27)+(ZETA/B$21)))))/((PSI/$A563*B$27)+(ZETA/B$21))*EXP(-ZETA*B$22))","v":1.1843714246146753},1.1843714246146753,1.1843714246146753,1.1843714246146753]
[5.0199999999999374,1.1843719923989411,1.1843719923989411,1.1843719923989411,1.1843719923989411]
[5.0299999999999372,1.1843725569067405,1.1843725569067405,1.1843725569067405,1.1843725569067405]
[5.039999999999937,1.1843731181632424,1.1843731181632424,1.1843731181632424,1.1843731181632424]
[5.0499999999999368,1.1843736761933732,1.1843736761933732,1.1843736761933732,1.1843736761933732]
[5.0599999999999365,1.1843742310218219,1.1843742310218219,1.1843742310218219,1.1843742310218219]
[5.0699999999999363,1.1843747826730411,1.1843747826730411,1.1843747826730411,1.1843747826730411]
[5.0799999999999361,1.1843753311712504,1.1843753311712504,1.1843753311712504,1.1843753311712504]
[5.0899999999999359,1.1843758765404395,1.1843758765404395,1.1843758765404395,1.1843758765404395]
[5.0999999999999357,1.1843764188043699,1.1843764188043699,1.1843764188043699,1.1843764188043699]
[5.1099999999999355,1.1843769579865777,1.1843769579865777,1.1843769579865777,1.1843769579865777]
[5.1199999999999353,1.1843774941103771,1.1843774941103771,1.1843774941103771,1.1843774941103771]
[5.1299999999999351,1.1843780271988611,1.1843780271988611,1.1843780271988611,1.1843780271988611]
[5.1399999999999348,1.1843785572749062,1.1843785572749062,1.1843785572749062,1.1843785572749062]
[5.1499999999999346,1.1843790843611728,1.1843790843611728,1.1843790843611728,1.1843790843611728]
[5.1599999999999344,1.1843796084801095,1.1843796084801095,1.1843796084801095,1.1843796084801095]
[5.1699999999999342,1.1843801296539536,1.1843801296539536,1.1843801296539536,1.1843801296539536]
[5.179999999999934,1.1843806479047354,1.1843806479047354,1.1843806479047354,1.1843806479047354]
[5.1899999999999338,1.1843811632542784,1.1843811632542784,1.1843811632542784,1.1843811632542784]
[5.1999999999999336,1.1843816757242041,1.1843816757242041,1.1843816757242041,1.1843816757242041]
[5.2099999999999334,{"$f":"(B$31*B$32)*(1-(LAMBDA/$A583*B$27)/((LAMBDA/$A583*B$27)+(ZETA/B$21))*((PSI/$A583*B$27)+((ZETA/B$21)*EXP(-$A583*((PSI/$A583*B$27)+(ZETA/B$21)))))/((PSI/$A583*B$27)+(ZETA/B$21))*EXP(-ZETA*B$22))","v":1.1843821853359315},1.1843821853359315,1.1843821853359315,1.1843821853359315]
[5.2199999999999331,1.1843826921106817,1.1843826921106817,1.1843826921106817,1.1843826921106817]
[5.2299999999999329,1.1843831960694791,1.1843831960694791,1.1843831960694791,1.1843831960694791]
[5.2399999999999327,1.1843836972331532,1.1843836972331532,1.1843836972331532,1.1843836972331532]
[5.2499999999999325,1.1843841956223415,1.1843841956223415,1.1843841956223415,1.1843841956223415]
[5.2599999999999323,1.1843846912574916,1.1843846912574916,1.1843846912574916,1.1843846912574916]
[5.2699999999999321,1.1843851841588622,1.1843851841588622,1.1843851841588622,1.1843851841588622]
[5.2799999999999319,1.1843856743465271,1.1843856743465271,1.1843856743465271,1.1843856743465271]
[5.2899999999999316,1.1843861618403755,1.1843861618403755,1.1843861618403755,1.1843861618403755]
[5.2999999999999314,1.1843866466601143,1.1843866466601143,1.1843866466601143,1.1843866466601143]
[5.3099999999999312,1.1843871288252716,1.1843871288252716,1.1843871288252716,1.1843871288252716]
[5.319999999999931,1.1843876083551963,1.1843876083551963,1.1843876083551963,1.1843876083551963]
[5.3299999999999308,1.1843880852690623,1.1843880852690623,1.1843880852690623,1.1843880852690623]
[5.3399999999999306,1.1843885595858685,1.1843885595858685,1.1843885595858685,1.1843885595858685]
[5.3499999999999304,1.1843890313244423,1.1843890313244423,1.1843890313244423,1.1843890313244423]
[5.3599999999999302,1.1843895005034404,1.1843895005034404,1.1843895005034404,1.1843895005034404]
[5.3699999999999299,1.1843899671413511,1.1843899671413511,1.1843899671413511,1.1843899671413511]
[5.3799999999999297,1.1843904312564961,1.1843904312564961,1.1843904312564961,1.1843904312564961]
[5.3899999999999295,1.1843908928670319,1.1843908928670319,1.1843908928670319,1.1843908928670319]
[5.3999999999999293,1.1843913519909526,1.1843913519909526,1.1843913519909526,1.1843913519909526]
[5.4099999999999291,{"$f":"(B$31*B$32)*(1-(LAMBDA/$A603*B$27)/((LAMBDA/$A603*B$27)+(ZETA/B$21))*((PSI/$A603*B$27)+((ZETA/B$21)*EXP(-$A603*((PSI/$A603*B$27)+(ZETA/B$21)))))/((PSI/$A603*B$27)+(ZETA/B$21))*EXP(-ZETA*B$22))","v":1.1843918086460901},1.1843918086460901,1.1843918086460901,1.1843918086460901]
[5.4199999999999289,1.1843922628501173,1.1843922628501173,1.1843922628501173,1.1843922628501173]
[5.4299999999999287,1.1843927146205491,1.1843927146205491,1.1843927146205491,1.1843927146205491]
[5.4399999999999284,1.1843931639747438,1.1843931639747438,1.1843931639747438,1.1843931639747438]
[5.4499999999999282,1.1843936109299058,1.1843936109299058,1.1843936109299058,1.1843936109299058]
[5.459999999999928,1.1843940555030863,1.1843940555030863,1.1843940555030863,1.1843940555030863]
[5.4699999999999278,1.1843944977111851,1.1843944977111851,1.1843944977111851,1.1843944977111851]
[5.4799999999999276,1.1843949375709526,1.1843949375709526,1.1843949375709526,1.1843949375709526]
[5.4899999999999274,1.1843953750989908,1.1843953750989908,1.1843953750989908,1.1843953750989908]
[5.4999999999999272,1.1843958103117556,1.1843958103117556,1.1843958103117556,1.1843958103117556]
[5.509999999999927,1.1843962432255579,1.1843962432255579,1.1843962432255579,1.1843962432255579]
[5.5199999999999267,1.1843966738565648,1.1843966738565648,1.1843966738565648,1.1843966738565648]
[5.5299999999999265,1.184397102220802,1.184397102220802,1.184397102220802,1.184397102220802]
[5.5399999999999263,1.1843975283341546,1.1843975283341546,1.1843975283341546,1.1843975283341546]
[5.5499999999999261,1.1843979522123684,1.1843979522123684,1.1843979522123684,1.1843979522123684]
[5.5599999999999259,1.1843983738710524,1.1843983738710524,1.1843983738710524,1.1843983738710524]
[5.5699999999999257,1.184398793325679,1.184398793325679,1.184398793325679,1.184398793325679]
[5.5799999999999255,1.1843992105915861,1.1843992105915861,1.1843992105915861,1.1843992105915861]
[5.5899999999999253,1.1843996256839788,1.1843996256839788,1.1843996256839788,1.1843996256839788]
[5.599999999999925,1.1844000386179299,1.1844000386179299,1.1844000386179299,1.1844000386179299]
[5.6099999999999248,{"$f":"(B$31*B$32)*(1-(LAMBDA/$A623*B$27)/((LAMBDA/$A623*B$27)+(ZETA/B$21))*((PSI/$A623*B$27)+((ZETA/B$21)*EXP(-$A623*((PSI/$A623*B$27)+(ZETA/B$21)))))/((PSI/$A623*B$27)+(ZETA/B$21))*EXP(-ZETA*B$22))","v":1.1844004494083815},1.1844004494083815,1.1844004494083815,1.1844004494083815]
[5.6199999999999246,1.1844008580701471,1.1844008580701471,1.1844008580701471,1.1844008580701471]
[5.6299999999999244,1.1844012646179125,1.1844012646179125,1.1844012646179125,1.1844012646179125]
[{"$f":"A625+0.01","v":5.6399999999999242},1.1844016690662365,1.1844016690662365,1.1844016690662365,1.1844016690662365]
[5.649999999999924,1.1844020714295533,1.1844020714295533,1.1844020714295533,1.1844020714295533]
[5.6599999999999238,1.1844024717221731,1.1844024717221731,1.1844024717221731,1.1844024717221731]
[5.6699999999999235,1.1844028699582831,1.1844028699582831,1.1844028699582831,1.1844028699582831]
[5.6799999999999233,1.1844032661519499,1.1844032661519499,1.1844032661519499,1.1844032661519499]
[5.6899999999999231,1.1844036603171193,1.1844036603171193,1.1844036603171193,1.1844036603171193]
[5.6999999999999229,1.1844040524676185,1.1844040524676185,1.1844040524676185,1.1844040524676185]
[5.7099999999999227,1.1844044426171572,1.1844044426171572,1.1844044426171572,1.1844044426171572]
[5.7199999999999225,1.1844048307793287,1.1844048307793287,1.1844048307793287,1.1844048307793287]
[5.7299999999999223,1.1844052169676109,1.1844052169676109,1.1844052169676109,1.1844052169676109]
[5.7399999999999221,1.1844056011953674,1.1844056011953674,1.1844056011953674,1.1844056011953674]
[5.7499999999999218,1.1844059834758494,1.1844059834758494,1.1844059834758494,1.1844059834758494]
[5.7599999999999216,1.1844063638221958,1.1844063638221958,1.1844063638221958,1.1844063638221958]
[5.7699999999999214,1.1844067422474351,1.1844067422474351,1.1844067422474351,1.1844067422474351]
[5.7799999999999212,1.1844071187644862,1.1844071187644862,1.1844071187644862,1.1844071187644862]
[5.789999999999921,1.1844074933861597,1.1844074933861597,1.1844074933861597,1.1844074933861597]
[5.7999999999999208,1.1844078661251585,1.1844078661251585,1.1844078661251585,1.1844078661251585]
[5.8099999999999206,{"$f":"(B$31*B$32)*(1-(LAMBDA/$A643*B$27)/((LAMBDA/$A643*B$27)+(ZETA/B$21))*((PSI/$A643*B$27)+((ZETA/B$21)*EXP(-$A643*((PSI/$A643*B$27)+(ZETA/B$21)))))/((PSI/$A643*B$27)+(ZETA/B$21))*EXP(-ZETA*B$22))","v":1.1844082369940796},1.1844082369940796,1.1844082369940796,1.1844082369940796]
[5.8199999999999203,1.1844086060054144,1.1844086060054144,1.1844086060054144,1.1844086060054144]
[5.8299999999999201,1.1844089731715508,1.1844089731715508,1.1844089731715508,1.1844089731715508]
[5.8399999999999199,1.1844093385047731,1.1844093385047731,1.1844093385047731,1.1844093385047731]
[5.8499999999999197,1.1844097020172637,1.1844097020172637,1.1844097020172637,1.1844097020172637]
[5.8599999999999195,1.1844100637211037,1.1844100637211037,1.1844100637211037,1.1844100637211037]
[5.8699999999999193,1.184410423628274,1.184410423628274,1.184410423628274,1.184410423628274]
[5.8799999999999191,1.1844107817506575,1.1844107817506575,1.1844107817506575,1.1844107817506575]
[5.8899999999999189,1.1844111381000375,1.1844111381000375,1.1844111381000375,1.1844111381000375]
[5.8999999999999186,1.1844114926881011,1.1844114926881011,1.1844114926881011,1.1844114926881011]
[5.9099999999999184,1.1844118455264394,1.1844118455264394,1.1844118455264394,1.1844118455264394]
[5.9199999999999182,1.1844121966265477,1.1844121966265477,1.1844121966265477,1.1844121966265477]
[5.929999999999918,1.1844125459998274,1.1844125459998274,1.1844125459998274,1.1844125459998274]
[5.9399999999999178,1.1844128936575864,1.1844128936575864,1.1844128936575864,1.1844128936575864]
[5.9499999999999176,1.1844132396110401,1.1844132396110401,1.1844132396110401,1.1844132396110401]
[5.9599999999999174,1.1844135838713126,1.1844135838713126,1.1844135838713126,1.1844135838713126]
[5.9699999999999172,1.1844139264494375,1.1844139264494375,1.1844139264494375,1.1844139264494375]
[5.9799999999999169,1.184414267356358,1.184414267356358,1.184414267356358,1.184414267356358]
[5.9899999999999167,1.1844146066029293,1.1844146066029293,1.1844146066029293,1.1844146066029293]
[5.9999999999999165,1.1844149441999177,1.1844149441999177,1.1844149441999177,1.1844149441999177]
[6.0099999999999163,{"$f":"(B$31*B$32)*(1-(LAMBDA/$A663*B$27)/((LAMBDA/$A663*B$27)+(ZETA/B$21))*((PSI/$A663*B$27)+((ZETA/B$21)*EXP(-$A663*((PSI/$A663*B$27)+(ZETA/B$21)))))/((PSI/$A663*B$27)+(ZETA/B$21))*EXP(-ZETA*B$22))","v":1.184415280158003},1.184415280158003,1.184415280158003,1.184415280158003]
[6.0199999999999161,1.1844156144877787,1.1844156144877787,1.1844156144877787,1.1844156144877787]
[6.0299999999999159,1.1844159471997522,1.1844159471997522,1.1844159471997522,1.1844159471997522]
[6.0399999999999157,1.1844162783043473,1.1844162783043473,1.1844162783043473,1.1844162783043473]
[6.0499999999999154,1.1844166078119027,1.1844166078119027,1.1844166078119027,1.1844166078119027]
[6.0599999999999152,1.1844169357326753,1.1844169357326753,1.1844169357326753,1.1844169357326753]
[6.069999999999915,1.1844172620768387,1.1844172620768387,1.1844172620768387,1.1844172620768387]
[6.0799999999999148,1.1844175868544859,1.1844175868544859,1.1844175868544859,1.1844175868544859]
[6.0899999999999146,1.1844179100756291,1.1844179100756291,1.1844179100756291,1.1844179100756291]
[6.0999999999999144,1.1844182317502003,1.1844182317502003,1.1844182317502003,1.1844182317502003]
[6.1099999999999142,1.1844185518880526,1.1844185518880526,1.1844185518880526,1.1844185518880526]
[6.119999999999914,1.1844188704989607,1.1844188704989607,1.1844188704989607,1.1844188704989607]
[6.1299999999999137,1.1844191875926215,1.1844191875926215,1.1844191875926215,1.1844191875926215]
[6.1399999999999135,1.1844195031786557,1.1844195031786557,1.1844195031786557,1.1844195031786557]
[6.1499999999999133,1.1844198172666069,1.1844198172666069,1.1844198172666069,1.1844198172666069]
[6.1599999999999131,1.184420129865944,1.184420129865944,1.184420129865944,1.184420129865944]
[6.1699999999999129,1.184420440986061,1.184420440986061,1.184420440986061,1.184420440986061]
[6.1799999999999127,1.1844207506362776,1.1844207506362776,1.1844207506362776,1.1844207506362776]
[6.1899999999999125,1.184421058825841,1.184421058825841,1.184421058825841,1.184421058825841]
[6.1999999999999122,1.1844213655639246,1.1844213655639246,1.1844213655639246,1.1844213655639246]
[6.209999999999912,{"$f":"(B$31*B$32)*(1-(LAMBDA/$A683*B$27)/((LAMBDA/$A683*B$27)+(ZETA/B$21))*((PSI/$A683*B$27)+((ZETA/B$21)*EXP(-$A683*((PSI/$A683*B$27)+(ZETA/B$21)))))/((PSI/$A683*B$27)+(ZETA/B$21))*EXP(-ZETA*B$22))","v":1.1844216708596311},1.1844216708596311,1.1844216708596311,1.1844216708596311]
[6.2199999999999118,1.1844219747219911,1.1844219747219911,1.1844219747219911,1.1844219747219911]
[6.2299999999999116,1.1844222771599646,1.1844222771599646,1.1844222771599646,1.1844222771599646]
[6.2399999999999114,1.1844225781824427,1.1844225781824427,1.1844225781824427,1.1844225781824427]
[6.2499999999999112,1.184422877798246,1.184422877798246,1.184422877798246,1.184422877798246]
[6.259999999999911,1.184423176016127,1.184423176016127,1.184423176016127,1.184423176016127]
[6.2699999999999108,1.1844234728447705,1.1844234728447705,1.1844234728447705,1.1844234728447705]
[{"$f":"A689+0.01","v":6.2799999999999105},1.1844237682927932,1.1844237682927932,1.1844237682927932,1.1844237682927932]
[6.2899999999999103,1.1844240623687459,1.1844240623687459,1.1844240623687459,1.1844240623687459]
[6.2999999999999101,1.1844243550811129,1.1844243550811129,1.1844243550811129,1.1844243550811129]
[6.3099999999999099,1.1844246464383128,1.1844246464383128,1.1844246464383128,1.1844246464383128]
[6.3199999999999097,1.1844249364486998,1.1844249364486998,1.1844249364486998,1.1844249364486998]
[6.3299999999999095,1.1844252251205638,1.1844252251205638,1.1844252251205638,1.1844252251205638]
[6.3399999999999093,1.1844255124621303,1.1844255124621303,1.1844255124621303,1.1844255124621303]
[6.3499999999999091,1.1844257984815625,1.1844257984815625,1.1844257984815625,1.1844257984815625]
[6.3599999999999088,1.1844260831869606,1.1844260831869606,1.1844260831869606,1.1844260831869606]
[6.3699999999999086,1.1844263665863628,1.1844263665863628,1.1844263665863628,1.1844263665863628]
[6.3799999999999084,1.1844266486877466,1.1844266486877466,1.1844266486877466,1.1844266486877466]
[6.3899999999999082,1.1844269294990279,1.1844269294990279,1.1844269294990279,1.1844269294990279]
[6.399999999999908,1.1844272090280628,1.1844272090280628,1.1844272090280628,1.1844272090280628]
[6.4099999999999078,{"$f":"(B$31*B$32)*(1-(LAMBDA/$A703*B$27)/((LAMBDA/$A703*B$27)+(ZETA/B$21))*((PSI/$A703*B$27)+((ZETA/B$21)*EXP(-$A703*((PSI/$A703*B$27)+(ZETA/B$21)))))/((PSI/$A703*B$27)+(ZETA/B$21))*EXP(-ZETA*B$22))","v":1.1844274872826472},1.1844274872826472,1.1844274872826472,1.1844274872826472]
[6.4199999999999076,1.1844277642705183,1.1844277642705183,1.1844277642705183,1.1844277642705183]
[6.4299999999999073,1.1844280399993548,1.1844280399993548,1.1844280399993548,1.1844280399993548]
[6.4399999999999071,1.1844283144767764,1.1844283144767764,1.1844283144767764,1.1844283144767764]
[6.4499999999999069,1.1844285877103462,1.1844285877103462,1.1844285877103462,1.1844285877103462]
[6.4599999999999067,1.1844288597075698,1.1844288597075698,1.1844288597075698,1.1844288597075698]
[6.4699999999999065,1.1844291304758965,1.1844291304758965,1.1844291304758965,1.1844291304758965]
[6.4799999999999063,1.1844294000227191,1.1844294000227191,1.1844294000227191,1.1844294000227191]
[6.4899999999999061,1.1844296683553754,1.1844296683553754,1.1844296683553754,1.1844296683553754]
[6.4999999999999059,1.1844299354811478,1.1844299354811478,1.1844299354811478,1.1844299354811478]
[6.5099999999999056,1.1844302014072647,1.1844302014072647,1.1844302014072647,1.1844302014072647]
[6.5199999999999054,1.1844304661408998,1.1844304661408998,1.1844304661408998,1.1844304661408998]
[6.5299999999999052,1.1844307296891732,1.1844307296891732,1.1844307296891732,1.1844307296891732]
[6.539999999999905,1.1844309920591527,1.1844309920591527,1.1844309920591527,1.1844309920591527]
[6.5499999999999048,1.1844312532578531,1.1844312532578531,1.1844312532578531,1.1844312532578531]
[6.5599999999999046,1.1844315132922369,1.1844315132922369,1.1844315132922369,1.1844315132922369]
[6.5699999999999044,1.184431772169215,1.184431772169215,1.184431772169215,1.184431772169215]
[6.5799999999999041,1.1844320298956472,1.1844320298956472,1.1844320298956472,1.1844320298956472]
[6.5899999999999039,1.1844322864783428,1.1844322864783428,1.1844322864783428,1.1844322864783428]
[6.5999999999999037,1.1844325419240598,1.1844325419240598,1.1844325419240598,1.1844325419240598]
[6.6099999999999035,{"$f":"(B$31*B$32)*(1-(LAMBDA/$A723*B$27)/((LAMBDA/$A723*B$27)+(ZETA/B$21))*((PSI/$A723*B$27)+((ZETA/B$21)*EXP(-$A723*((PSI/$A723*B$27)+(ZETA/B$21)))))/((PSI/$A723*B$27)+(ZETA/B$21))*EXP(-ZETA*B$22))","v":1.1844327962395076},1.1844327962395076,1.1844327962395076,1.1844327962395076]
[6.6199999999999033,1.1844330494313453,1.1844330494313453,1.1844330494313453,1.1844330494313453]
[6.6299999999999031,1.1844333015061834,1.1844333015061834,1.1844333015061834,1.1844333015061834]
[6.6399999999999029,1.1844335524705842,1.1844335524705842,1.1844335524705842,1.1844335524705842]
[6.6499999999999027,1.1844338023310608,1.1844338023310608,1.1844338023310608,1.1844338023310608]
[6.6599999999999024,1.1844340510940798,1.1844340510940798,1.1844340510940798,1.1844340510940798]
[6.6699999999999022,1.1844342987660597,1.1844342987660597,1.1844342987660597,1.1844342987660597]
[6.679999999999902,1.1844345453533722,1.1844345453533722,1.1844345453533722,1.1844345453533722]
[6.6899999999999018,1.1844347908623434,1.1844347908623434,1.1844347908623434,1.1844347908623434]
[6.6999999999999016,1.1844350352992523,1.1844350352992523,1.1844350352992523,1.1844350352992523]
[6.7099999999999014,1.1844352786703325,1.1844352786703325,1.1844352786703325,1.1844352786703325]
[6.7199999999999012,1.1844355209817727,1.1844355209817727,1.1844355209817727,1.1844355209817727]
[6.729999999999901,1.1844357622397166,1.1844357622397166,1.1844357622397166,1.1844357622397166]
[6.7399999999999007,1.1844360024502636,1.1844360024502636,1.1844360024502636,1.1844360024502636]
[6.7499999999999005,1.1844362416194683,1.1844362416194683,1.1844362416194683,1.1844362416194683]
[6.7599999999999003,1.1844364797533422,1.1844364797533422,1.1844364797533422,1.1844364797533422]
[6.7699999999999001,1.1844367168578538,1.1844367168578538,1.1844367168578538,1.1844367168578538]
[6.7799999999998999,1.1844369529389278,1.1844369529389278,1.1844369529389278,1.1844369529389278]
[6.7899999999998997,1.1844371880024469,1.1844371880024469,1.1844371880024469,1.1844371880024469]
[6.7999999999998995,1.1844374220542513,1.1844374220542513,1.1844374220542513,1.1844374220542513]
[6.8099999999998992,{"$f":"(B$31*B$32)*(1-(LAMBDA/$A743*B$27)/((LAMBDA/$A743*B$27)+(ZETA/B$21))*((PSI/$A743*B$27)+((ZETA/B$21)*EXP(-$A743*((PSI/$A743*B$27)+(ZETA/B$21)))))/((PSI/$A743*B$27)+(ZETA/B$21))*EXP(-ZETA*B$22))","v":1.1844376551001397},1.1844376551001397,1.1844376551001397,1.1844376551001397]
[6.819999999999899,1.184437887145869,1.184437887145869,1.184437887145869,1.184437887145869]
[6.8299999999998988,1.1844381181971553,1.1844381181971553,1.1844381181971553,1.1844381181971553]
[6.8399999999998986,1.1844383482596732,1.1844383482596732,1.1844383482596732,1.1844383482596732]
[6.8499999999998984,1.1844385773390578,1.1844385773390578,1.1844385773390578,1.1844385773390578]
[6.8599999999998982,1.1844388054409034,1.1844388054409034,1.1844388054409034,1.1844388054409034]
[6.869999999999898,1.1844390325707652,1.1844390325707652,1.1844390325707652,1.1844390325707652]
[6.8799999999998978,1.1844392587341583,1.1844392587341583,1.1844392587341583,1.1844392587341583]
[6.8899999999998975,1.1844394839365588,1.1844394839365588,1.1844394839365588,1.1844394839365588]
[6.8999999999998973,1.184439708183405,1.184439708183405,1.184439708183405,1.184439708183405]
[6.9099999999998971,1.1844399314800955,1.1844399314800955,1.1844399314800955,1.1844399314800955]
[{"$f":"A753+0.01","v":6.9199999999998969},1.1844401538319917,1.1844401538319917,1.1844401538319917,1.1844401538319917]
[6.9299999999998967,1.184440375244417,1.184440375244417,1.184440375244417,1.184440375244417]
[6.9399999999998965,1.1844405957226571,1.1844405957226571,1.1844405957226571,1.1844405957226571]
[6.9499999999998963,1.184440815271961,1.184440815271961,1.184440815271961,1.184440815271961]
[6.959999999999896,1.1844410338975404,1.1844410338975404,1.1844410338975404,1.1844410338975404]
[6.9699999999998958,1.1844412516045708,1.1844412516045708,1.1844412516045708,1.1844412516045708]
[6.9799999999998956,1.1844414683981916,1.1844414683981916,1.1844414683981916,1.1844414683981916]
[6.9899999999998954,1.1844416842835062,1.1844416842835062,1.1844416842835062,1.1844416842835062]
[6.9999999999998952,1.1844418992655819,1.1844418992655819,1.1844418992655819,1.1844418992655819]
[7.009999999999895,{"$f":"(B$31*B$32)*(1-(LAMBDA/$A763*B$27)/((LAMBDA/$A763*B$27)+(ZETA/B$21))*((PSI/$A763*B$27)+((ZETA/B$21)*EXP(-$A763*((PSI/$A763*B$27)+(ZETA/B$21)))))/((PSI/$A763*B$27)+(ZETA/B$21))*EXP(-ZETA*B$22))","v":1.1844421133494518},1.1844421133494518,1.1844421133494518,1.1844421133494518]
[7.0199999999998948,1.1844423265401127,1.1844423265401127,1.1844423265401127,1.1844423265401127]
[7.0299999999998946,1.1844425388425279,1.1844425388425279,1.1844425388425279,1.1844425388425279]
[7.0399999999998943,1.1844427502616255,1.1844427502616255,1.1844427502616255,1.1844427502616255]
[7.0499999999998941,1.1844429608022995,1.1844429608022995,1.1844429608022995,1.1844429608022995]
[7.0599999999998939,1.1844431704694103,1.1844431704694103,1.1844431704694103,1.1844431704694103]
[7.0699999999998937,1.1844433792677851,1.1844433792677851,1.1844433792677851,1.1844433792677851]
[7.0799999999998935,1.1844435872022165,1.1844435872022165,1.1844435872022165,1.1844435872022165]
[7.0899999999998933,1.1844437942774657,1.1844437942774657,1.1844437942774657,1.1844437942774657]
[7.0999999999998931,1.1844440004982602,1.1844440004982602,1.1844440004982602,1.1844440004982602]
[7.1099999999998929,1.1844442058692948,1.1844442058692948,1.1844442058692948,1.1844442058692948]
[7.1199999999998926,1.1844444103952327,1.1844444103952327,1.1844444103952327,1.1844444103952327]
[7.1299999999998924,1.1844446140807054,1.1844446140807054,1.1844446140807054,1.1844446140807054]
[7.1399999999998922,1.1844448169303117,1.1844448169303117,1.1844448169303117,1.1844448169303117]
[7.149999999999892,1.1844450189486195,1.1844450189486195,1.1844450189486195,1.1844450189486195]
[7.1599999999998918,1.1844452201401661,1.1844452201401661,1.1844452201401661,1.1844452201401661]
[7.1699999999998916,1.184445420509457,1.184445420509457,1.184445420509457,1.184445420509457]
[7.1799999999998914,1.1844456200609677,1.1844456200609677,1.1844456200609677,1.1844456200609677]
[7.1899999999998911,1.1844458187991425,1.1844458187991425,1.1844458187991425,1.1844458187991425]
[7.1999999999998909,1.1844460167283963,1.1844460167283963,1.1844460167283963,1.1844460167283963]
[7.2099999999998907,{"$f":"(B$31*B$32)*(1-(LAMBDA/$A783*B$27)/((LAMBDA/$A783*B$27)+(ZETA/B$21))*((PSI/$A783*B$27)+((ZETA/B$21)*EXP(-$A783*((PSI/$A783*B$27)+(ZETA/B$21)))))/((PSI/$A783*B$27)+(ZETA/B$21))*EXP(-ZETA*B$22))","v":1.184446213853114},1.184446213853114,1.184446213853114,1.184446213853114]
[7.2199999999998905,1.1844464101776506,1.1844464101776506,1.1844464101776506,1.1844464101776506]
[7.2299999999998903,1.1844466057063314,1.1844466057063314,1.1844466057063314,1.1844466057063314]
[7.2399999999998901,1.184446800443453,1.184446800443453,1.184446800443453,1.184446800443453]
[7.2499999999998899,1.1844469943932829,1.1844469943932829,1.1844469943932829,1.1844469943932829]
[7.2599999999998897,1.1844471875600597,1.1844471875600597,1.1844471875600597,1.1844471875600597]
[7.2699999999998894,1.184447379947994,1.184447379947994,1.184447379947994,1.184447379947994]
[7.2799999999998892,1.1844475715612675,1.1844475715612675,1.1844475715612675,1.1844475715612675]
[7.289999999999889,1.1844477624040342,1.1844477624040342,1.1844477624040342,1.1844477624040342]
[7.2999999999998888,1.1844479524804201,1.1844479524804201,1.1844479524804201,1.1844479524804201]
[7.3099999999998886,1.1844481417945241,1.1844481417945241,1.1844481417945241,1.1844481417945241]
[7.3199999999998884,1.184448330350417,1.184448330350417,1.184448330350417,1.184448330350417]
[7.3299999999998882,1.1844485181521431,1.1844485181521431,1.1844485181521431,1.1844485181521431]
[7.3399999999998879,1.1844487052037194,1.1844487052037194,1.1844487052037194,1.1844487052037194]
[7.3499999999998877,1.1844488915091365,1.1844488915091365,1.1844488915091365,1.1844488915091365]
[7.3599999999998875,1.1844490770723579,1.1844490770723579,1.1844490770723579,1.1844490770723579]
[7.3699999999998873,1.1844492618973217,1.1844492618973217,1.1844492618973217,1.1844492618973217]
[7.3799999999998871,1.1844494459879389,1.1844494459879389,1.1844494459879389,1.1844494459879389]
[7.3899999999998869,1.1844496293480955,1.1844496293480955,1.1844496293480955,1.1844496293480955]
[7.3999999999998867,1.1844498119816516,1.1844498119816516,1.1844498119816516,1.1844498119816516]
[7.4099999999998865,{"$f":"(B$31*B$32)*(1-(LAMBDA/$A803*B$27)/((LAMBDA/$A803*B$27)+(ZETA/B$21))*((PSI/$A803*B$27)+((ZETA/B$21)*EXP(-$A803*((PSI/$A803*B$27)+(ZETA/B$21)))))/((PSI/$A803*B$27)+(ZETA/B$21))*EXP(-ZETA*B$22))","v":1.1844499938924411},1.1844499938924411,1.1844499938924411,1.1844499938924411]
[7.4199999999998862,1.1844501750842737,1.1844501750842737,1.1844501750842737,1.1844501750842737]
[7.429999999999886,1.1844503555609336,1.1844503555609336,1.1844503555609336,1.1844503555609336]
[7.4399999999998858,1.1844505353261801,1.1844505353261801,1.1844505353261801,1.1844505353261801]
[7.4499999999998856,1.1844507143837477,1.1844507143837477,1.1844507143837477,1.1844507143837477]
[7.4599999999998854,1.1844508927373465,1.1844508927373465,1.1844508927373465,1.1844508927373465]
[7.4699999999998852,1.1844510703906628,1.1844510703906628,1.1844510703906628,1.1844510703906628]
[7.479999999999885,1.1844512473473578,1.1844512473473578,1.1844512473473578,1.1844512473473578]
[7.4899999999998847,1.1844514236110699,1.1844514236110699,1.1844514236110699,1.1844514236110699]
[7.4999999999998845,1.184451599185413,1.184451599185413,1.184451599185413,1.184451599185413]
[7.5099999999998843,1.1844517740739775,1.1844517740739775,1.1844517740739775,1.1844517740739775]
[7.5199999999998841,1.1844519482803313,1.1844519482803313,1.1844519482803313,1.1844519482803313]
[7.5299999999998839,1.184452121808018,1.184452121808018,1.184452121808018,1.184452121808018]
[7.5399999999998837,1.1844522946605587,1.1844522946605587,1.1844522946605587,1.1844522946605587]
[7.5499999999998835,1.1844524668414518,1.1844524668414518,1.1844524668414518,1.1844524668414518]
[{"$f":"A817+0.01","v":7.5599999999998833},1.1844526383541731,1.1844526383541731,1.1844526383541731,1.1844526383541731]
[7.569999999999883,1.184452809202176,1.184452809202176,1.184452809202176,1.184452809202176]
[7.5799999999998828,1.1844529793888909,1.1844529793888909,1.1844529793888909,1.1844529793888909]
[7.5899999999998826,1.184453148917727,1.184453148917727,1.184453148917727,1.184453148917727]
[7.5999999999998824,1.1844533177920711,1.1844533177920711,1.1844533177920711,1.1844533177920711]
[7.6099999999998822,{"$f":"(B$31*B$32)*(1-(LAMBDA/$A823*B$27)/((LAMBDA/$A823*B$27)+(ZETA/B$21))*((PSI/$A823*B$27)+((ZETA/B$21)*EXP(-$A823*((PSI/$A823*B$27)+(ZETA/B$21)))))/((PSI/$A823*B$27)+(ZETA/B$21))*EXP(-ZETA*B$22))","v":1.1844534860152884},1.1844534860152884,1.1844534860152884,1.1844534860152884]
[7.619999999999882,1.1844536535907222,1.1844536535907222,1.1844536535907222,1.1844536535907222]
[7.6299999999998818,1.1844538205216948,1.1844538205216948,1.1844538205216948,1.1844538205216948]
[7.6399999999998816,1.1844539868115069,1.1844539868115069,1.1844539868115069,1.1844539868115069]
[7.6499999999998813,1.1844541524634382,1.1844541524634382,1.1844541524634382,1.1844541524634382]
[7.6599999999998811,1.1844543174807476,1.1844543174807476,1.1844543174807476,1.1844543174807476]
[7.6699999999998809,1.1844544818666729,1.1844544818666729,1.1844544818666729,1.1844544818666729]
[7.6799999999998807,1.1844546456244314,1.1844546456244314,1.1844546456244314,1.1844546456244314]
[7.6899999999998805,1.18445480875722,1.18445480875722,1.18445480875722,1.18445480875722]
[7.6999999999998803,1.1844549712682153,1.1844549712682153,1.1844549712682153,1.1844549712682153]
[7.7099999999998801,1.1844551331605739,1.1844551331605739,1.1844551331605739,1.1844551331605739]
[7.7199999999998798,1.1844552944374318,1.1844552944374318,1.1844552944374318,1.1844552944374318]
[7.7299999999998796,1.1844554551019058,1.1844554551019058,1.1844554551019058,1.1844554551019058]
[7.7399999999998794,1.1844556151570926,1.1844556151570926,1.1844556151570926,1.1844556151570926]
[7.7499999999998792,1.1844557746060698,1.1844557746060698,1.1844557746060698,1.1844557746060698]
[7.759999999999879,1.1844559334518947,1.1844559334518947,1.1844559334518947,1.1844559334518947]
[7.7699999999998788,1.1844560916976064,1.1844560916976064,1.1844560916976064,1.1844560916976064]
[7.7799999999998786,1.1844562493462243,1.1844562493462243,1.1844562493462243,1.1844562493462243]
[7.7899999999998784,1.1844564064007488,1.1844564064007488,1.1844564064007488,1.1844564064007488]
[7.7999999999998781,1.1844565628641617,1.1844565628641617,1.1844565628641617,1.1844565628641617]
[7.8099999999998779,{"$f":"(B$31*B$32)*(1-(LAMBDA/$A843*B$27)/((LAMBDA/$A843*B$27)+(ZETA/B$21))*((PSI/$A843*B$27)+((ZETA/B$21)*EXP(-$A843*((PSI/$A843*B$27)+(ZETA/B$21)))))/((PSI/$A843*B$27)+(ZETA/B$21))*EXP(-ZETA*B$22))","v":1.1844567187394259},1.1844567187394259,1.1844567187394259,1.1844567187394259]
[7.8199999999998777,1.1844568740294861,1.1844568740294861,1.1844568740294861,1.1844568740294861]
[7.8299999999998775,1.1844570287372682,1.1844570287372682,1.1844570287372682,1.1844570287372682]
[7.8399999999998773,1.1844571828656802,1.1844571828656802,1.1844571828656802,1.1844571828656802]
[7.8499999999998771,1.1844573364176116,1.1844573364176116,1.1844573364176116,1.1844573364176116]
[7.8599999999998769,1.1844574893959341,1.1844574893959341,1.1844574893959341,1.1844574893959341]
[7.8699999999998766,1.1844576418035015,1.1844576418035015,1.1844576418035015,1.1844576418035015]
[7.8799999999998764,1.18445779364315,1.18445779364315,1.18445779364315,1.18445779364315]
[7.8899999999998762,1.184457944917698,1.184457944917698,1.184457944917698,1.184457944917698]
[7.899999999999876,1.1844580956299464,1.1844580956299464,1.1844580956299464,1.1844580956299464]
[7.9099999999998758,1.1844582457826793,1.1844582457826793,1.1844582457826793,1.1844582457826793]
[7.9199999999998756,1.1844583953786627,1.1844583953786627,1.1844583953786627,1.1844583953786627]
[7.9299999999998754,1.1844585444206464,1.1844585444206464,1.1844585444206464,1.1844585444206464]
[7.9399999999998752,1.1844586929113625,1.1844586929113625,1.1844586929113625,1.1844586929113625]
[7.9499999999998749,1.184458840853527,1.184458840853527,1.184458840853527,1.184458840853527]
[7.9599999999998747,1.1844589882498384,1.1844589882498384,1.1844589882498384,1.1844589882498384]
[7.9699999999998745,1.1844591351029794,1.1844591351029794,1.1844591351029794,1.1844591351029794]
[7.9799999999998743,1.1844592814156159,1.1844592814156159,1.1844592814156159,1.1844592814156159]
[7.9899999999998741,1.1844594271903972,1.1844594271903972,1.1844594271903972,1.1844594271903972]
[7.9999999999998739,1.1844595724299569,1.1844595724299569,1.1844595724299569,1.1844595724299569]
[8.0099999999998737,{"$f":"(B$31*B$32)*(1-(LAMBDA/$A863*B$27)/((LAMBDA/$A863*B$27)+(ZETA/B$21))*((PSI/$A863*B$27)+((ZETA/B$21)*EXP(-$A863*((PSI/$A863*B$27)+(ZETA/B$21)))))/((PSI/$A863*B$27)+(ZETA/B$21))*EXP(-ZETA*B$22))","v":1.1844597171369118},1.1844597171369118,1.1844597171369118,1.1844597171369118]
[8.0199999999998735,1.1844598613138637,1.1844598613138637,1.1844598613138637,1.1844598613138637]
[8.0299999999998732,1.1844600049633975,1.1844600049633975,1.1844600049633975,1.1844600049633975]
[8.039999999999873,1.1844601480880832,1.1844601480880832,1.1844601480880832,1.1844601480880832]
[8.0499999999998728,1.1844602906904746,1.1844602906904746,1.1844602906904746,1.1844602906904746]
[8.0599999999998726,1.1844604327731103,1.1844604327731103,1.1844604327731103,1.1844604327731103]
[8.0699999999998724,1.1844605743385135,1.1844605743385135,1.1844605743385135,1.1844605743385135]
[8.0799999999998722,1.1844607153891915,1.1844607153891915,1.1844607153891915,1.1844607153891915]
[8.089999999999872,1.1844608559276375,1.1844608559276375,1.1844608559276375,1.1844608559276375]
[8.0999999999998717,1.1844609959563288,1.1844609959563288,1.1844609959563288,1.1844609959563288]
[8.1099999999998715,1.1844611354777279,1.1844611354777279,1.1844611354777279,1.1844611354777279]
[8.1199999999998713,1.1844612744942826,1.1844612744942826,1.1844612744942826,1.1844612744942826]
[8.1299999999998711,1.1844614130084261,1.1844614130084261,1.1844614130084261,1.1844614130084261]
[8.1399999999998709,1.1844615510225762,1.1844615510225762,1.1844615510225762,1.1844615510225762]
[8.1499999999998707,1.184461688539137,1.184461688539137,1.184461688539137,1.184461688539137]
[8.1599999999998705,1.1844618255604979,1.1844618255604979,1.1844618255604979,1.1844618255604979]
[8.1699999999998703,1.1844619620890342,1.1844619620890342,1.1844619620890342,1.1844619620890342]
[8.17999999999987,1.1844620981271061,1.1844620981271061,1.1844620981271061,1.1844620981271061]
[8.1899999999998698,1.1844622336770609,1.1844622336770609,1.1844622336770609,1.1844622336770609]
[{"$f":"A881+0.01","v":8.1999999999998696},1.1844623687412308,1.1844623687412308,1.1844623687412308,1.1844623687412308]
[8.2099999999998694,{"$f":"(B$31*B$32)*(1-(LAMBDA/$A883*B$27)/((LAMBDA/$A883*B$27)+(ZETA/B$21))*((PSI/$A883*B$27)+((ZETA/B$21)*EXP(-$A883*((PSI/$A883*B$27)+(ZETA/B$21)))))/((PSI/$A883*B$27)+(ZETA/B$21))*EXP(-ZETA*B$22))","v":1.1844625033219349},1.1844625033219349,1.1844625033219349,1.1844625033219349]
[8.2199999999998692,1.1844626374214782,1.1844626374214782,1.1844626374214782,1.1844626374214782]
[8.229999999999869,1.1844627710421516,1.1844627710421516,1.1844627710421516,1.1844627710421516]
[8.2399999999998688,1.1844629041862327,1.1844629041862327,1.1844629041862327,1.1844629041862327]
[8.2499999999998685,1.1844630368559859,1.1844630368559859,1.1844630368559859,1.1844630368559859]
[8.2599999999998683,1.1844631690536616,1.1844631690536616,1.1844631690536616,1.1844631690536616]
[8.2699999999998681,1.1844633007814971,1.1844633007814971,1.1844633007814971,1.1844633007814971]
[8.2799999999998679,1.1844634320417164,1.1844634320417164,1.1844634320417164,1.1844634320417164]
[8.2899999999998677,1.1844635628365305,1.1844635628365305,1.1844635628365305,1.1844635628365305]
[8.2999999999998675,1.1844636931681376,1.1844636931681376,1.1844636931681376,1.1844636931681376]
[8.3099999999998673,1.1844638230387221,1.1844638230387221,1.1844638230387221,1.1844638230387221]
[8.3199999999998671,1.1844639524504563,1.1844639524504563,1.1844639524504563,1.1844639524504563]
[8.3299999999998668,1.1844640814054996,1.1844640814054996,1.1844640814054996,1.1844640814054996]
[8.3399999999998666,1.1844642099059981,1.1844642099059981,1.1844642099059981,1.1844642099059981]
[8.3499999999998664,1.1844643379540862,1.1844643379540862,1.1844643379540862,1.1844643379540862]
[8.3599999999998662,1.1844644655518852,1.1844644655518852,1.1844644655518852,1.1844644655518852]
[8.369999999999866,1.1844645927015041,1.1844645927015041,1.1844645927015041,1.1844645927015041]
[8.3799999999998658,1.1844647194050397,1.1844647194050397,1.1844647194050397,1.1844647194050397]
[8.3899999999998656,1.1844648456645765,1.1844648456645765,1.1844648456645765,1.1844648456645765]
[8.3999999999998654,1.1844649714821867,1.1844649714821867,1.1844649714821867,1.1844649714821867]
[8.4099999999998651,{"$f":"(B$31*B$32)*(1-(LAMBDA/$A903*B$27)/((LAMBDA/$A903*B$27)+(ZETA/B$21))*((PSI/$A903*B$27)+((ZETA/B$21)*EXP(-$A903*((PSI/$A903*B$27)+(ZETA/B$21)))))/((PSI/$A903*B$27)+(ZETA/B$21))*EXP(-ZETA*B$22))","v":1.1844650968599304},1.1844650968599304,1.1844650968599304,1.1844650968599304]
[8.4199999999998649,1.1844652217998561,1.1844652217998561,1.1844652217998561,1.1844652217998561]
[8.4299999999998647,1.184465346304,1.184465346304,1.184465346304,1.184465346304]
[8.4399999999998645,1.1844654703743864,1.1844654703743864,1.1844654703743864,1.1844654703743864]
[8.4499999999998643,1.1844655940130286,1.1844655940130286,1.1844655940130286,1.1844655940130286]
[8.4599999999998641,1.1844657172219271,1.1844657172219271,1.1844657172219271,1.1844657172219271]
[8.4699999999998639,1.1844658400030714,1.1844658400030714,1.1844658400030714,1.1844658400030714]
[8.4799999999998636,1.1844659623584401,1.1844659623584401,1.1844659623584401,1.1844659623584401]
[8.4899999999998634,1.1844660842899992,1.1844660842899992,1.1844660842899992,1.1844660842899992]
[8.4999999999998632,1.1844662057997042,1.1844662057997042,1.1844662057997042,1.1844662057997042]
[8.509999999999863,1.184466326889499,1.184466326889499,1.184466326889499,1.184466326889499]
[8.5199999999998628,1.1844664475613165,1.1844664475613165,1.1844664475613165,1.1844664475613165]
[8.5299999999998626,1.184466567817078,1.184466567817078,1.184466567817078,1.184466567817078]
[8.5399999999998624,1.1844666876586947,1.1844666876586947,1.1844666876586947,1.1844666876586947]
[8.5499999999998622,1.184466807088066,1.184466807088066,1.184466807088066,1.184466807088066]
[8.5599999999998619,1.1844669261070806,1.1844669261070806,1.1844669261070806,1.1844669261070806]
[8.5699999999998617,1.1844670447176167,1.1844670447176167,1.1844670447176167,1.1844670447176167]
[8.5799999999998615,1.1844671629215415,1.1844671629215415,1.1844671629215415,1.1844671629215415]
[8.5899999999998613,1.1844672807207117,1.1844672807207117,1.1844672807207117,1.1844672807207117]
[8.5999999999998611,1.1844673981169733,1.1844673981169733,1.1844673981169733,1.1844673981169733]
[8.6099999999998609,{"$f":"(B$31*B$32)*(1-(LAMBDA/$A923*B$27)/((LAMBDA/$A923*B$27)+(ZETA/B$21))*((PSI/$A923*B$27)+((ZETA/B$21)*EXP(-$A923*((PSI/$A923*B$27)+(ZETA/B$21)))))/((PSI/$A923*B$27)+(ZETA/B$21))*EXP(-ZETA*B$22))","v":1.1844675151121618},1.1844675151121618,1.1844675151121618,1.1844675151121618]
[8.6199999999998607,1.184467631708102,1.184467631708102,1.184467631708102,1.184467631708102]
[8.6299999999998604,1.184467747906609,1.184467747906609,1.184467747906609,1.184467747906609]
[8.6399999999998602,1.1844678637094872,1.1844678637094872,1.1844678637094872,1.1844678637094872]
[8.64999999999986,1.1844679791185304,1.1844679791185304,1.1844679791185304,1.1844679791185304]
[8.6599999999998598,1.184468094135523,1.184468094135523,1.184468094135523,1.184468094135523]
[8.6699999999998596,1.1844682087622387,1.1844682087622387,1.1844682087622387,1.1844682087622387]
[8.6799999999998594,1.1844683230004416,1.1844683230004416,1.1844683230004416,1.1844683230004416]
[8.6899999999998592,1.1844684368518854,1.1844684368518854,1.1844684368518854,1.1844684368518854]
[8.699999999999859,1.1844685503183141,1.1844685503183141,1.1844685503183141,1.1844685503183141]
[8.7099999999998587,1.1844686634014623,1.1844686634014623,1.1844686634014623,1.1844686634014623]
[8.7199999999998585,1.1844687761030541,1.1844687761030541,1.1844687761030541,1.1844687761030541]
[8.7299999999998583,1.1844688884248047,1.1844688884248047,1.1844688884248047,1.1844688884248047]
[8.7399999999998581,1.1844690003684191,1.1844690003684191,1.1844690003684191,1.1844690003684191]
[8.7499999999998579,1.1844691119355926,1.1844691119355926,1.1844691119355926,1.1844691119355926]
[8.7599999999998577,1.1844692231280118,1.1844692231280118,1.1844692231280118,1.1844692231280118]
[8.7699999999998575,1.1844693339473531,1.1844693339473531,1.1844693339473531,1.1844693339473531]
[8.7799999999998573,1.1844694443952837,1.1844694443952837,1.1844694443952837,1.1844694443952837]
[8.789999999999857,1.184469554473462,1.184469554473462,1.184469554473462,1.184469554473462]
[8.7999999999998568,1.1844696641835364,1.1844696641835364,1.1844696641835364,1.1844696641835364]
[8.8099999999998566,{"$f":"(B$31*B$32)*(1-(LAMBDA/$A943*B$27)/((LAMBDA/$A943*B$27)+(ZETA/B$21))*((PSI/$A943*B$27)+((ZETA/B$21)*EXP(-$A943*((PSI/$A943*B$27)+(ZETA/B$21)))))/((PSI/$A943*B$27)+(ZETA/B$21))*EXP(-ZETA*B$22))","v":1.1844697735271468},1.1844697735271468,1.1844697735271468,1.1844697735271468]
[8.8199999999998564,1.1844698825059234,1.1844698825059234,1.1844698825059234,1.1844698825059234]
[8.8299999999998562,1.184469991121488,1.184469991121488,1.184469991121488,1.184469991121488]
[{"$f":"A945+0.01","v":8.839999999999856},1.1844700993754524,1.1844700993754524,1.1844700993754524,1.1844700993754524]
[8.8499999999998558,1.1844702072694204,1.1844702072694204,1.1844702072694204,1.1844702072694204]
[8.8599999999998555,1.1844703148049869,1.1844703148049869,1.1844703148049869,1.1844703148049869]
[8.8699999999998553,1.1844704219837374,1.1844704219837374,1.1844704219837374,1.1844704219837374]
[8.8799999999998551,1.1844705288072488,1.1844705288072488,1.1844705288072488,1.1844705288072488]
[8.8899999999998549,1.1844706352770895,1.1844706352770895,1.1844706352770895,1.1844706352770895]
[8.8999999999998547,1.1844707413948192,1.1844707413948192,1.1844707413948192,1.1844707413948192]
[8.9099999999998545,1.1844708471619889,1.1844708471619889,1.1844708471619889,1.1844708471619889]
[8.9199999999998543,1.1844709525801413,1.1844709525801413,1.1844709525801413,1.1844709525801413]
[8.9299999999998541,1.1844710576508104,1.1844710576508104,1.1844710576508104,1.1844710576508104]
[8.9399999999998538,1.184471162375522,1.184471162375522,1.184471162375522,1.184471162375522]
[8.9499999999998536,1.1844712667557928,1.1844712667557928,1.1844712667557928,1.1844712667557928]
[8.9599999999998534,1.1844713707931325,1.1844713707931325,1.1844713707931325,1.1844713707931325]
[8.9699999999998532,1.1844714744890414,1.1844714744890414,1.1844714744890414,1.1844714744890414]
[8.979999999999853,1.1844715778450121,1.1844715778450121,1.1844715778450121,1.1844715778450121]
[8.9899999999998528,1.1844716808625291,1.1844716808625291,1.1844716808625291,1.1844716808625291]
[8.9999999999998526,1.1844717835430685,1.1844717835430685,1.1844717835430685,1.1844717835430685]
[9.0099999999998523,{"$f":"(B$31*B$32)*(1-(LAMBDA/$A963*B$27)/((LAMBDA/$A963*B$27)+(ZETA/B$21))*((PSI/$A963*B$27)+((ZETA/B$21)*EXP(-$A963*((PSI/$A963*B$27)+(ZETA/B$21)))))/((PSI/$A963*B$27)+(ZETA/B$21))*EXP(-ZETA*B$22))","v":1.1844718858880987},1.1844718858880987,1.1844718858880987,1.1844718858880987]
[9.0199999999998521,1.1844719878990797,1.1844719878990797,1.1844719878990797,1.1844719878990797]
[9.0299999999998519,1.1844720895774641,1.1844720895774641,1.1844720895774641,1.1844720895774641]
[9.0399999999998517,1.184472190924696,1.184472190924696,1.184472190924696,1.184472190924696]
[9.0499999999998515,1.1844722919422124,1.1844722919422124,1.1844722919422124,1.1844722919422124]
[9.0599999999998513,1.1844723926314418,1.1844723926314418,1.1844723926314418,1.1844723926314418]
[9.0699999999998511,1.1844724929938051,1.1844724929938051,1.1844724929938051,1.1844724929938051]
[9.0799999999998509,1.1844725930307163,1.1844725930307163,1.1844725930307163,1.1844725930307163]
[9.0899999999998506,1.1844726927435807,1.1844726927435807,1.1844726927435807,1.1844726927435807]
[9.0999999999998504,1.1844727921337967,1.1844727921337967,1.1844727921337967,1.1844727921337967]
[9.1099999999998502,1.1844728912027549,1.1844728912027549,1.1844728912027549,1.1844728912027549]
[9.11999999999985,1.1844729899518383,1.1844729899518383,1.1844729899518383,1.1844729899518383]
[9.1299999999998498,1.1844730883824226,1.1844730883824226,1.1844730883824226,1.1844730883824226]
[9.1399999999998496,1.1844731864958766,1.1844731864958766,1.1844731864958766,1.1844731864958766]
[9.1499999999998494,1.1844732842935608,1.1844732842935608,1.1844732842935608,1.1844732842935608]
[9.1599999999998492,1.1844733817768291,1.1844733817768291,1.1844733817768291,1.1844733817768291]
[9.1699999999998489,1.1844734789470281,1.1844734789470281,1.1844734789470281,1.1844734789470281]
[9.1799999999998487,1.1844735758054967,1.1844735758054967,1.1844735758054967,1.1844735758054967]
[9.1899999999998485,1.1844736723535674,1.1844736723535674,1.1844736723535674,1.1844736723535674]
[9.1999999999998483,1.1844737685925648,1.1844737685925648,1.1844737685925648,1.1844737685925648]
[9.2099999999998481,{"$f":"(B$31*B$32)*(1-(LAMBDA/$A983*B$27)/((LAMBDA/$A983*B$27)+(ZETA/B$21))*((PSI/$A983*B$27)+((ZETA/B$21)*EXP(-$A983*((PSI/$A983*B$27)+(ZETA/B$21)))))/((PSI/$A983*B$27)+(ZETA/B$21))*EXP(-ZETA*B$22))","v":1.1844738645238071},1.1844738645238071,1.1844738645238071,1.1844738645238071]
[9.2199999999998479,1.1844739601486052,1.1844739601486052,1.1844739601486052,1.1844739601486052]
[9.2299999999998477,1.1844740554682629,1.1844740554682629,1.1844740554682629,1.1844740554682629]
[9.2399999999998474,1.1844741504840772,1.1844741504840772,1.1844741504840772,1.1844741504840772]
[9.2499999999998472,1.1844742451973385,1.1844742451973385,1.1844742451973385,1.1844742451973385]
[9.259999999999847,1.1844743396093296,1.1844743396093296,1.1844743396093296,1.1844743396093296]
[9.2699999999998468,1.1844744337213275,1.1844744337213275,1.1844744337213275,1.1844744337213275]
[9.2799999999998466,1.1844745275346016,1.1844745275346016,1.1844745275346016,1.1844745275346016]
[9.2899999999998464,1.1844746210504151,1.1844746210504151,1.1844746210504151,1.1844746210504151]
[9.2999999999998462,1.1844747142700245,1.1844747142700245,1.1844747142700245,1.1844747142700245]
[9.309999999999846,1.1844748071946789,1.1844748071946789,1.1844748071946789,1.1844748071946789]
[9.3199999999998457,1.1844748998256223,1.1844748998256223,1.1844748998256223,1.1844748998256223]
[9.3299999999998455,1.1844749921640905,1.1844749921640905,1.1844749921640905,1.1844749921640905]
[9.3399999999998453,1.1844750842113141,1.1844750842113141,1.1844750842113141,1.1844750842113141]
[9.3499999999998451,1.1844751759685166,1.1844751759685166,1.1844751759685166,1.1844751759685166]
[9.3599999999998449,1.1844752674369152,1.1844752674369152,1.1844752674369152,1.1844752674369152]
[9.3699999999998447,1.1844753586177206,1.1844753586177206,1.1844753586177206,1.1844753586177206]
[9.3799999999998445,1.1844754495121377,1.1844754495121377,1.1844754495121377,1.1844754495121377]
[9.3899999999998442,1.1844755401213642,1.1844755401213642,1.1844755401213642,1.1844755401213642]
[9.399999999999844,1.1844756304465924,1.1844756304465924,1.1844756304465924,1.1844756304465924]
[9.4099999999998438,{"$f":"(B$31*B$32)*(1-(LAMBDA/$A1003*B$27)/((LAMBDA/$A1003*B$27)+(ZETA/B$21))*((PSI/$A1003*B$27)+((ZETA/B$21)*EXP(-$A1003*((PSI/$A1003*B$27)+(ZETA/B$21)))))/((PSI/$A1003*B$27)+(ZETA/B$21))*EXP(-ZETA*B$22))","v":1.184475720489008},1.184475720489008,1.184475720489008,1.184475720489008]
[9.4199999999998436,1.1844758102497903,1.1844758102497903,1.1844758102497903,1.1844758102497903]
[9.4299999999998434,1.1844758997301128,1.1844758997301128,1.1844758997301128,1.1844758997301128]
[9.4399999999998432,1.1844759889311429,1.1844759889311429,1.1844759889311429,1.1844759889311429]
[9.449999999999843,1.1844760778540415,1.1844760778540415,1.1844760778540415,1.1844760778540415]
[9.4599999999998428,1.1844761664999643,1.1844761664999643,1.1844761664999643,1.1844761664999643]
[9.4699999999998425,1.1844762548700603,1.1844762548700603,1.1844762548700603,1.1844762548700603]
[{"$f":"A1009+0.01","v":9.4799999999998423},1.1844763429654723,1.1844763429654723,1.1844763429654723,1.1844763429654723]
[9.4899999999998421,1.1844764307873381,1.1844764307873381,1.1844764307873381,1.1844764307873381]
[9.4999999999998419,1.1844765183367891,1.1844765183367891,1.1844765183367891,1.1844765183367891]
[9.5099999999998417,1.1844766056149507,1.1844766056149507,1.1844766056149507,1.1844766056149507]
[9.5199999999998415,1.1844766926229431,1.1844766926229431,1.1844766926229431,1.1844766926229431]
[9.5299999999998413,1.1844767793618798,1.1844767793618798,1.1844767793618798,1.1844767793618798]
[9.5399999999998411,1.1844768658328693,1.1844768658328693,1.1844768658328693,1.1844768658328693]
[9.5499999999998408,1.1844769520370144,1.1844769520370144,1.1844769520370144,1.1844769520370144]
[9.5599999999998406,1.1844770379754117,1.1844770379754117,1.1844770379754117,1.1844770379754117]
[9.5699999999998404,1.1844771236491527,1.1844771236491527,1.1844771236491527,1.1844771236491527]
[9.5799999999998402,1.184477209059323,1.184477209059323,1.184477209059323,1.184477209059323]
[9.58999999999984,1.1844772942070025,1.1844772942070025,1.1844772942070025,1.1844772942070025]
[9.5999999999998398,1.1844773790932663,1.1844773790932663,1.1844773790932663,1.1844773790932663]
[9.6099999999998396,{"$f":"(B$31*B$32)*(1-(LAMBDA/$A1023*B$27)/((LAMBDA/$A1023*B$27)+(ZETA/B$21))*((PSI/$A1023*B$27)+((ZETA/B$21)*EXP(-$A1023*((PSI/$A1023*B$27)+(ZETA/B$21)))))/((PSI/$A1023*B$27)+(ZETA/B$21))*EXP(-ZETA*B$22))","v":1.1844774637191831},1.1844774637191831,1.1844774637191831,1.1844774637191831]
[9.6199999999998393,1.1844775480858167,1.1844775480858167,1.1844775480858167,1.1844775480858167]
[9.6299999999998391,1.1844776321942252,1.1844776321942252,1.1844776321942252,1.1844776321942252]
[9.6399999999998389,1.1844777160454618,1.1844777160454618,1.1844777160454618,1.1844777160454618]
[9.6499999999998387,1.1844777996405735,1.1844777996405735,1.1844777996405735,1.1844777996405735]
[9.6599999999998385,1.1844778829806026,1.1844778829806026,1.1844778829806026,1.1844778829806026]
[9.6699999999998383,1.1844779660665861,1.1844779660665861,1.1844779660665861,1.1844779660665861]
[9.6799999999998381,1.1844780488995552,1.1844780488995552,1.1844780488995552,1.1844780488995552]
[9.6899999999998379,1.1844781314805368,1.1844781314805368,1.1844781314805368,1.1844781314805368]
[9.6999999999998376,1.1844782138105514,1.1844782138105514,1.1844782138105514,1.1844782138105514]
[9.7099999999998374,1.1844782958906157,1.1844782958906157,1.1844782958906157,1.1844782958906157]
[9.7199999999998372,1.18447837772174,1.18447837772174,1.18447837772174,1.18447837772174]
[9.729999999999837,1.1844784593049302,1.1844784593049302,1.1844784593049302,1.1844784593049302]
[9.7399999999998368,1.1844785406411869,1.1844785406411869,1.1844785406411869,1.1844785406411869]
[9.7499999999998366,1.1844786217315058,1.1844786217315058,1.1844786217315058,1.1844786217315058]
[9.7599999999998364,1.1844787025768775,1.1844787025768775,1.1844787025768775,1.1844787025768775]
[9.7699999999998361,1.1844787831782875,1.1844787831782875,1.1844787831782875,1.1844787831782875]
[9.7799999999998359,1.1844788635367169,1.1844788635367169,1.1844788635367169,1.1844788635367169]
[9.7899999999998357,1.1844789436531409,1.1844789436531409,1.1844789436531409,1.1844789436531409]
[9.7999999999998355,1.1844790235285305,1.1844790235285305,1.1844790235285305,1.1844790235285305]
[9.8099999999998353,{"$f":"(B$31*B$32)*(1-(LAMBDA/$A1043*B$27)/((LAMBDA/$A1043*B$27)+(ZETA/B$21))*((PSI/$A1043*B$27)+((ZETA/B$21)*EXP(-$A1043*((PSI/$A1043*B$27)+(ZETA/B$21)))))/((PSI/$A1043*B$27)+(ZETA/B$21))*EXP(-ZETA*B$22))","v":1.1844791031638522},1.1844791031638522,1.1844791031638522,1.1844791031638522]
[9.8199999999998351,1.1844791825600662,1.1844791825600662,1.1844791825600662,1.1844791825600662]
[9.8299999999998349,1.1844792617181299,1.1844792617181299,1.1844792617181299,1.1844792617181299]
[9.8399999999998347,1.184479340638994,1.184479340638994,1.184479340638994,1.184479340638994]
[9.8499999999998344,1.1844794193236057,1.1844794193236057,1.1844794193236057,1.1844794193236057]
[9.8599999999998342,1.1844794977729072,1.1844794977729072,1.1844794977729072,1.1844794977729072]
[9.869999999999834,1.1844795759878359,1.1844795759878359,1.1844795759878359,1.1844795759878359]
[9.8799999999998338,1.1844796539693243,1.1844796539693243,1.1844796539693243,1.1844796539693243]
[9.8899999999998336,1.1844797317183007,1.1844797317183007,1.1844797317183007,1.1844797317183007]
[9.8999999999998334,1.1844798092356887,1.1844798092356887,1.1844798092356887,1.1844798092356887]
[9.9099999999998332,1.1844798865224069,1.1844798865224069,1.1844798865224069,1.1844798865224069]
[9.919999999999833,1.1844799635793699,1.1844799635793699,1.1844799635793699,1.1844799635793699]
[9.9299999999998327,1.1844800404074876,1.1844800404074876,1.1844800404074876,1.1844800404074876]
[9.9399999999998325,1.1844801170076653,1.1844801170076653,1.1844801170076653,1.1844801170076653]
[9.9499999999998323,1.1844801933808038,1.1844801933808038,1.1844801933808038,1.1844801933808038]
[9.9599999999998321,1.1844802695277996,1.1844802695277996,1.1844802695277996,1.1844802695277996]
[9.9699999999998319,1.1844803454495445,1.1844803454495445,1.1844803454495445,1.1844803454495445]
[9.9799999999998317,1.1844804211469264,1.1844804211469264,1.1844804211469264,1.1844804211469264]
[9.9899999999998315,1.1844804966208282,1.1844804966208282,1.1844804966208282,1.1844804966208282]
[9.9999999999998312,1.1844805718721292,1.1844805718721292,1.1844805718721292,1.1844805718721292]