{"text_format":"1","workbook":"xlsx","n_sheets":5,"sheets":["1. ENTER DATA","2. RESULTS","3. CALCS_Loads","4. CALCS_Infiltration","5.CALCS_Adams&Papa"],"not_rendered":{"charts":11,"images":1,"macros":1,"external_links":0,"defined_names":94,"comments":1,"pivot_tables":0},"unopened":[],"bounds":{"document_bytes":16777216,"sheet_cells":100000,"rows_first":2000,"rows_last":500,"rows_between":2000,"halvings":0,"cell_chars":16384,"cell_head_chars":4096},"cells_cut":0,"cells_raw":0,"read":"whole","date_system":"1900"}

{"sheet":"1. ENTER DATA","index":0,"n_rows":82,"n_cols":22,"rows_kept":82,"cut":false,"hidden":false,"merged":[[1,16,1,21],[23,1,23,3],[24,1,24,3],[11,1,11,2],[14,1,14,3],[10,1,10,7],[22,1,22,7],[0,1,0,7],[81,9,81,10],[58,9,58,10],[42,1,42,3],[53,1,53,3],[52,1,52,3],[48,1,48,3],[46,1,46,3],[57,1,57,3],[51,1,51,3],[50,1,50,3],[45,1,45,3],[35,1,35,3],[1,1,1,7],[28,1,28,3],[27,9,27,10],[59,1,59,7],[55,1,55,3],[25,1,25,3],[26,1,26,3],[40,1,40,3],[36,1,36,3],[31,1,31,3],[41,1,41,3],[34,1,34,3],[33,1,33,3],[30,1,30,3],[32,1,32,3],[54,1,54,3],[29,1,29,3],[27,1,27,3]]}
["Row","STORMWATER LOAD ANALYSIS TOOL (SLAT) - Beta Version"]
[2,"For full instructions, see user manual.",null,null,null,null,null,null,null,null,null,null,null,null,null,null,"Internal Lists"]
[{"$f":"A2+1","v":3},"(1) Enable Macros in the worksheet."]
[4,"(2) If performing a new analysis, click \"Restore Defaults\" button to the right.",null,null,null,null,null,null,null,null,null,null,null,null,null,null,"BMP 1 Options","BMP 2 Options","Conveyance Options","WQV Options","Drainage areas","Infiltration Field Options"]
[5,"(3) Answer questions in the yellow cells. Move vertically from top to bottom.",null,null,null,null,null,null,null,null,null,null,null,null,null,null,"None","None","Pumped","Yes",1,"Irrigation"]
[6,"(4) Click \"View Full Results\" button at bottom. ",null,null,null,null,null,null,null,null,null,null,null,null,null,null,"Biofiltration","Infiltration Field","Gravity Drained","No",2,"Level spread"]
[7,"Note: This worksheet assumes: SCMs IN SERIES that treat a specified drainage area, and the second SCM only receives treated volume (not bypass/overflow) from the first SCM. ",null,null,null,null,null,null,null,null,null,null,null,null,null,null,"Retention Basin","Beneficial Reuse",null,null,3,"N/A"]
[8,null,null,null,null,null,null,null,null,null,null,null,null,null,null,null,"Rainwater Harvesting","Alternative",null,null,4]
[9,"KEY","Required User Input","Key User Input","Internal Calculation","Error","Calculator Output","Does Not Apply",null,null,null,null,null,null,null,null,"Sedimentation/Filtration",null,null,"Splitter Options"]
[10,null,null,null,null,null,null,null,null,null,null,null,null,null,null,null,"Alternative",null,null,"Yes (Off-Line)"]
[11,"Step 1: Input site characteristics in yellow highlighted cells",null,null,null,null,null,null,null,null,null,null,null,null,null,null,null,null,null,"No (On-Line)"]
[12,"Site Name",null,null,"Editor Name",null,"Date","SLAT Beta - 8/2014",null,"Simplified Schematic"]
[13,null,null,null,null,null,null,null,null,null,null,null,null,null,null,null,"FOR PLOTTING",null,null,"Infiltration Options","Infiltration Field Options"]
[14,"Is your site within the Barton Springs Zone? ",null,null,"Yes",null,null,null,null,null,null,null,null,null,null,null,"Captions",null,null,"Yes","Yes"]
[15,"How many drainage areas, nmax, does your site have? ",null,null,1,null,null,null,null,null,null,null,null,null,null,null,"Existing","Developed, Untreated","Proposed","No; infiltrate all routed water","No; calculate area"]
[16,null,null,null,"Drainage Area A","Drainage Area B","Drainage Area C","Drainage Area D"]
[17,"Drainage area to the control, An (Acres)",null,null,1,1,1,1,null,null,null,null,null,null,null,null,"Baseline Loads",null,null,"Compliance Factor"]
[18,"Base impervious cover of the drainage area, ICB (%)",null,null,0,0,0,0,null,null,null,null,null,null,null,null,null,null,null,"Compliance Factor (Compare to Baseline)"]
[19,"Developed impervious cover of the drainage area, ICD (%)",null,null,0,0,0,0,null,null,null,null,null,null,null,null,null,null,null,"Compliance Factor (Compare to Sed/Fil)"]
[20,"Annual average runoff for existing site, VEx (in/yr)",null,null,{"$f":"'3. CALCS_Loads'!C83","v":1.1845187709210347},{"$f":"'3. CALCS_Loads'!D83","v":0},{"$f":"'3. CALCS_Loads'!E83","v":0},{"$f":"'3. CALCS_Loads'!M16","v":0}]
[21,"Annual average runoff for developed site, Vd (in/yr)",null,null,{"$f":"'3. CALCS_Loads'!C88","v":1.1845187709210347},{"$f":"'3. CALCS_Loads'!D88","v":0},{"$f":"'3. CALCS_Loads'!E88","v":0},{"$f":"'3. CALCS_Loads'!F88","v":0}]
[22]
[23,"Step 2: Input SCM characteristics in yellow highlighted cells"]
[24,null,null,null,"Drainage Area A","Drainage Area B","Drainage Area C","Drainage Area D"]
[25,"SCM 1 (First in Series)",null,null,"SCM A1","SCM B1","SCM C1","SCM D1"]
[26,"SCM Type",null,null,"Retention Basin","Retention Basin","Retention Basin","Retention Basin"]
[27,"Is SCM 1 off-line?",null,null,"Yes (Off-Line)","Yes (Off-Line)","Yes (Off-Line)","Yes (Off-Line)"]
[28,"What is the water quality volume, WQV, (in)?",null,null,2.5,2.5,2.5,2.5,null,{"$f":"'2. RESULTS'!G18","v":"COMPLIANT"}]
[29,"Minimum water quality volume (1/2\" Plus Rule)",null,null,{"$f":"'3. CALCS_Loads'!C93","v":0.5},{"$f":"'3. CALCS_Loads'!D93","v":0.5},{"$f":"'3. CALCS_Loads'!E93","v":0.5},{"$f":"'3. CALCS_Loads'!F93","v":0.5}]
[30,"SCM 1 Actual Volume (ft3)",null,null,{"$f":"WQV_A1*DA_A*3630","v":9075},{"$f":"WQV_B1*DA_B*3630","v":9075},{"$f":"WQV_C1*DA_C*3630","v":9075},{"$f":"WQV_D1*DA_D*3630","v":9075}]
{"$rows_left_out":53}
{"sheet":"2. RESULTS","index":1,"n_rows":39,"n_cols":19,"rows_kept":39,"cut":false,"hidden":false,"merged":[[0,10,0,17],[5,8,6,8],[34,4,35,4],[34,3,35,3],[5,0,6,1],[5,7,6,7],[5,9,6,9],[34,5,35,5],[26,0,26,2],[28,5,30,5],[17,6,18,7],[28,4,30,4],[34,7,35,7],[28,3,30,3],[28,0,30,2],[33,0,33,2],[38,0,38,2],[28,6,30,6],[34,6,35,6],[5,2,5,6],[0,0,0,7],[27,0,27,2],[28,7,30,7],[37,0,37,2],[36,0,36,2],[34,0,35,2],[32,0,32,2],[31,0,31,2]]}
["SLAT: Stormwater Load Analysis Tool",null,null,null,null,null,null,null,null,"1/2","SLAT: Stormwater Load Analysis Tool",null,null,null,null,null,null,null,"2/2"]
["Site Name:",{"$f":"'1. ENTER DATA'!B12","v":"Site Name"},null,null,"By:",{"$f":"'1. ENTER DATA'!E12","v":"Editor Name"},null,"Date:",{"$f":"'1. ENTER DATA'!G12","v":"Date"},null,"Site Name:",{"$f":"B2","v":"Site Name"},null,null,"By:",{"$f":"F2","v":"Editor Name"},null,"Date:",{"$f":"I2","v":"Date"}]
["RESULTS: COMPLIANCE TABLE",null,null,null,null,null,null,null,null,{"$f":"'1. ENTER DATA'!H12","v":"SLAT Beta - 8/2014"},"RESULTS: PLOTS",null,null,null,null,null,null,null,{"$f":"'1. ENTER DATA'!H12","v":"SLAT Beta - 8/2014"}]
[]
[]
["POLLUTANT",null,"DEVELOPED LOAD, WITH CONTROLS",null,null,null,null,{"$f":"IF('1. ENTER DATA'!E14=\"Yes\",\"EXISTING LOAD, L_Ex\",\"SED/FIL LOAD\")","v":"EXISTING LOAD, L_Ex"},"LOAD EQUIV. FACTOR, LEF","COMPLIES?"]
[null,null,"Drainage Area A","Drainage Area B","Drainage Area C","Drainage Area D","TOTAL LOAD, Lout"]
["COD","lbs/yr",{"$f":"'3. CALCS_Loads'!Z178","v":3.145137382800792E-3},{"$f":"'3. CALCS_Loads'!AA178","v":0},{"$f":"'3. CALCS_Loads'!AB178","v":0},{"$f":"'3. CALCS_Loads'!AC178","v":0},{"$f":"SUM(C8:F8)","v":3.145137382800792E-3},{"$f":"IF('1. ENTER DATA'!$E$14=\"Yes\",'3. CALCS_Loads'!AD178,'3. CALCS_Loads'!AE178)","v":10.445832768807366},{"$f":"IF('1. ENTER DATA'!$E$14=\"Yes\",'3. CALCS_Loads'!AH178,'3. CALCS_Loads'!AI178)","v":3.0109015263891524E-4},{"$f":"IF('1. ENTER DATA'!$E$14=\"Yes\",'3. CALCS_Loads'!AJ178,'3. CALCS_Loads'!AK178)","v":"YES"}]
["E. coli","10^6 MPN/yr",{"$f":"'3. CALCS_Loads'!Z179","v":4.7029872910259956},{"$f":"'3. CALCS_Loads'!AA179","v":0},{"$f":"'3. CALCS_Loads'!AB179","v":0},{"$f":"'3. CALCS_Loads'!AC179","v":0},{"$f":"SUM(C9:F9)","v":4.7029872910259956},{"$f":"IF('1. ENTER DATA'!$E$14=\"Yes\",'3. CALCS_Loads'!AD179,'3. CALCS_Loads'!AE179)","v":10193.469623240113},{"$f":"IF('1. ENTER DATA'!$E$14=\"Yes\",'3. CALCS_Loads'!AH179,'3. CALCS_Loads'!AI179)","v":4.6137257134740904E-4},{"$f":"IF('1. ENTER DATA'!$E$14=\"Yes\",'3. CALCS_Loads'!AJ179,'3. CALCS_Loads'!AK179)","v":"YES"}]
["Pb","lbs/yr",{"$f":"'3. CALCS_Loads'!Z180","v":5.3983662621656143E-7},{"$f":"'3. CALCS_Loads'!AA180","v":0},{"$f":"'3. CALCS_Loads'!AB180","v":0},{"$f":"'3. CALCS_Loads'!AC180","v":0},5.3983662621656143E-7,{"$f":"IF('1. ENTER DATA'!$E$14=\"Yes\",'3. CALCS_Loads'!AD180,'3. CALCS_Loads'!AE180)","v":1.1501157261902815E-3},{"$f":"IF('1. ENTER DATA'!$E$14=\"Yes\",'3. CALCS_Loads'!AH180,'3. CALCS_Loads'!AI180)","v":4.693759192431457E-4},{"$f":"IF('1. ENTER DATA'!$E$14=\"Yes\",'3. CALCS_Loads'!AJ180,'3. CALCS_Loads'!AK180)","v":"YES"}]
["TN","lbs/yr",{"$f":"'3. CALCS_Loads'!Z181","v":1.6842875663676288E-4},{"$f":"'3. CALCS_Loads'!AA181","v":0},{"$f":"'3. CALCS_Loads'!AB181","v":0},{"$f":"'3. CALCS_Loads'!AC181","v":0},1.6842875663676288E-4,{"$f":"IF('1. ENTER DATA'!$E$14=\"Yes\",'3. CALCS_Loads'!AD181,'3. CALCS_Loads'!AE181)","v":0.31955118238768027},{"$f":"IF('1. ENTER DATA'!$E$14=\"Yes\",'3. CALCS_Loads'!AH181,'3. CALCS_Loads'!AI181)","v":5.2707912196808804E-4},{"$f":"IF('1. ENTER DATA'!$E$14=\"Yes\",'3. CALCS_Loads'!AJ181,'3. CALCS_Loads'!AK181)","v":"YES"}]
["TOC","lbs/yr",{"$f":"'3. CALCS_Loads'!Z182","v":1.1988437757766395E-3},{"$f":"'3. CALCS_Loads'!AA182","v":0},{"$f":"'3. CALCS_Loads'!AB182","v":0},{"$f":"'3. CALCS_Loads'!AC182","v":0},{"$f":"SUM(C12:F12)","v":1.1988437757766395E-3},{"$f":"IF('1. ENTER DATA'!$E$14=\"Yes\",'3. CALCS_Loads'!AD182,'3. CALCS_Loads'!AE182)","v":3.4989511819424157},{"$f":"IF('1. ENTER DATA'!$E$14=\"Yes\",'3. CALCS_Loads'!AH182,'3. CALCS_Loads'!AI182)","v":3.4262946621367569E-4},{"$f":"IF('1. ENTER DATA'!$E$14=\"Yes\",'3. CALCS_Loads'!AJ182,'3. CALCS_Loads'!AK182)","v":"YES"}]
["TP","lbs/yr",{"$f":"'3. CALCS_Loads'!Z183","v":2.1114560025418703E-5},{"$f":"'3. CALCS_Loads'!AA183","v":0},{"$f":"'3. CALCS_Loads'!AB183","v":0},{"$f":"'3. CALCS_Loads'!AC183","v":0},2.1114560025418703E-5,{"$f":"IF('1. ENTER DATA'!$E$14=\"Yes\",'3. CALCS_Loads'!AD183,'3. CALCS_Loads'!AE183)","v":3.329777026560702E-2},{"$f":"IF('1. ENTER DATA'!$E$14=\"Yes\",'3. CALCS_Loads'!AH183,'3. CALCS_Loads'!AI183)","v":6.3411333122289422E-4},{"$f":"IF('1. ENTER DATA'!$E$14=\"Yes\",'3. CALCS_Loads'!AJ183,'3. CALCS_Loads'!AK183)","v":"YES"}]
["TSS","lbs/yr",{"$f":"'3. CALCS_Loads'!Z184","v":2.4184034042407884E-3},{"$f":"'3. CALCS_Loads'!AA184","v":0},{"$f":"'3. CALCS_Loads'!AB184","v":0},{"$f":"'3. CALCS_Loads'!AC184","v":0},2.4184034042407884E-3,{"$f":"IF('1. ENTER DATA'!$E$14=\"Yes\",'3. CALCS_Loads'!AD184,'3. CALCS_Loads'!AE184)","v":44.576047291054564},{"$f":"IF('1. ENTER DATA'!$E$14=\"Yes\",'3. CALCS_Loads'!AH184,'3. CALCS_Loads'!AI184)","v":5.4253428718120301E-5},{"$f":"IF('1. ENTER DATA'!$E$14=\"Yes\",'3. CALCS_Loads'!AJ184,'3. CALCS_Loads'!AK184)","v":"YES"}]
["Zn","lbs/yr",{"$f":"'3. CALCS_Loads'!Z185","v":2.9701727986909343E-6},{"$f":"'3. CALCS_Loads'!AA185","v":0},{"$f":"'3. CALCS_Loads'!AB185","v":0},{"$f":"'3. CALCS_Loads'!AC185","v":0},2.9701727986909343E-6,{"$f":"IF('1. ENTER DATA'!$E$14=\"Yes\",'3. CALCS_Loads'!AD185,'3. CALCS_Loads'!AE185)","v":6.3279190024921744E-3},{"$f":"IF('1. ENTER DATA'!$E$14=\"Yes\",'3. CALCS_Loads'!AH185,'3. CALCS_Loads'!AI185)","v":4.6937591924314575E-4},{"$f":"IF('1. ENTER DATA'!$E$14=\"Yes\",'3. CALCS_Loads'!AJ185,'3. CALCS_Loads'!AK185)","v":"YES"}]
[]
[]
[null,null,null,null,null,null,{"$f":"IF(I8<=1,IF(I9<=1,IF(I10<=1,IF(I11<=1,IF(I13<=1,IF(I14<=1,IF(I15<=1,\"COMPLIANT\",\"NOT COMPLIANT\"),\"NOT COMPLIANT\"),\"NOT COMPLIANT\"),\"NOT COMPLIANT\"),\"NOT COMPLIANT\"),\"NOT COMPLIANT\"),\"NOT COMPLIANT\")","v":"COMPLIANT"}]
[]
[]
[]
[]
[]
["SUMMARY OF INPUTS"]
[]
[null,null,null,"Drainage Area A","Drainage Area B","Drainage Area C","Drainage Area D","TOTALS"]
["Drainage Area, An (Ac)",null,null,{"$f":"DA_A","v":1},{"$f":"IF(n_DA=1,\"N/A\",DA_B)","v":"N/A"},{"$f":"IF(n_DA<3,\"N/A\",DA_C)","v":"N/A"},{"$f":"IF(n_DA<4,\"N/A\",DA_D)","v":"N/A"},{"$f":"SUM(D27:G27)","v":1}]
["Developed IC, ICD (%)",null,null,{"$f":"ICA_d","v":0},{"$f":"IF(n_DA=1,\"N/A\",ICB_d)","v":"N/A"},{"$f":"IF(n_DA<3,\"N/A\",ICC_d)","v":"N/A"},{"$f":"IF(n_DA<4,\"N/A\",ICD_d)","v":"N/A"},{"$f":"(D28*D27+IF(n_DA>1,E28*E27,0)+IF(n_DA>2,F28*F27,0)+IF(n_DA>3,G28*G27,0))/(100*H27)","v":0}]
["SCM 1",null,null,{"$f":"'1. ENTER DATA'!E26","v":"Retention Basin"},{"$f":"IF(n_DA=1,\"N/A\",'1. ENTER DATA'!F26)","v":"N/A"},{"$f":"IF(n_DA<3,\"N/A\",'1. ENTER DATA'!G26)","v":"N/A"},{"$f":"IF(n_DA<4,\"N/A\",'1. ENTER DATA'!H26)","v":"N/A"},"-"]
[]
{"$rows_left_out":10}
{"sheet":"3. CALCS_Loads","index":2,"n_rows":208,"n_cols":37,"rows_kept":208,"cut":false,"hidden":false,"merged":[[61,0,63,0],[160,1,160,16],[174,30,175,30],[174,29,175,29],[161,13,161,16],[161,9,161,12],[161,5,161,8],[61,16,61,17],[61,18,61,19],[61,20,61,21],[175,21,175,24],[175,13,175,16],[175,9,175,12],[175,5,175,8],[175,1,175,4],[161,1,161,4],[34,8,34,11],[34,3,34,7],[174,36,176,36],[174,35,176,35],[160,21,161,24],[160,17,161,20],[175,17,175,20],[175,25,175,28],[174,32,175,32],[174,31,175,31]]}
["CONSTANTS"]
[31.73,"R, annual rainfall, in/yr","(CM-09-04, Pg 51)"]
[79.33,"Annual no. rainfall events, θ, events/yr"]
[]
["CONVERSION FACTORS"]
["CF_1","Pollutant in mg/L",0.22670000000000001,"lb-L/(mg-Ac-in)","Outputs to lb/Ac-yr"]
["CF_2","Pollutant in MPN/100 mL",1.0279,"100 mL/(Ac-in)","Outputs to 10^6 MPN/Ac-yr"]
[]
["ECM TABLE 1.9: Runoff (From Table 3.2, CM-09-03)"]
["IC (%)","Rv","Sd","Runoff Events","Runoff (in)"]
[0,6.4000000000000001E-2,0.218,46,1.18]
[5,0.1,0.19800000000000001,48.4,1.94]
[10,0.13600000000000001,0.18,50.6,2.76]
[15,0.17199999999999999,0.16300000000000001,52.8,3.63]
[20,0.20799999999999999,0.14799999999999999,54.8,4.55]
[25,0.24299999999999999,0.13400000000000001,56.7,5.52]
[30,0.27900000000000003,0.122,58.5,6.54]
[35,0.315,0.11,60.2,7.59]
[40,0.35099999999999998,0.1,61.8,8.67]
[45,0.38700000000000001,9.0999999999999998E-2,63.2,9.7799999999999994]
[50,0.42299999999999999,8.2000000000000003E-2,64.599999999999994,10.91]
[55.000000000000007,0.45800000000000002,7.4999999999999997E-2,65.8,12.06]
[60,0.49399999999999999,6.8000000000000005E-2,66.900000000000006,13.23]
[65,0.53,6.2E-2,68,14.42]
[70,0.56599999999999995,5.6000000000000001E-2,69,15.61]
[75,0.60199999999999998,5.0999999999999997E-2,69.900000000000006,16.82]
[80,0.63700000000000001,4.5999999999999999E-2,70.7,18.03]
[85,0.67300000000000004,4.2000000000000003E-2,71.5,19.239999999999998]
[90,0.70899999999999996,3.7999999999999999E-2,72.2,20.46]
[95,0.745,3.4000000000000002E-2,72.8,21.69]
{"$rows_left_out":179}
{"sheet":"4. CALCS_Infiltration","index":3,"n_rows":39,"n_cols":10,"rows_kept":39,"cut":false,"hidden":false,"merged":[]}
["SIZING INFILTRATION FIELDS"]
[]
[null,null,null,null,"SCM A2","SCM B2","SCM C2","SCM D2"]
["Drainage Area",null,null,"Ac",{"$f":"DA_A","v":1},{"$f":"DA_B","v":1},{"$f":"DA_C","v":1},{"$f":"DA_D","v":1},null,"*Assume: More helpful to start with \"Volume treated\" and then back-calculate the area required. "]
["Water application factor",null,null,null,{"$f":"1/'1. ENTER DATA'!E52","v":0.5},{"$f":"1/'1. ENTER DATA'!F52","v":0.5},{"$f":"1/'1. ENTER DATA'!G52","v":0.5},{"$f":"1/'1. ENTER DATA'!H52","v":0.5},null,"(Between 12 and 72 hours), longer duration = smaller field area"]
["Total irrigation time",null,null,"hrs",{"$f":"'1. ENTER DATA'!E54","v":60},{"$f":"'1. ENTER DATA'!F54","v":60},{"$f":"'1. ENTER DATA'!G54","v":60},{"$f":"'1. ENTER DATA'!H54","v":60},null,"Accounts for alternating on/off watering"]
["Water application time",null,null,"hrs",{"$f":"E6*E5","v":30},{"$f":"F6*F5","v":30},{"$f":"G6*G5","v":30},{"$f":"H6*H5","v":30},null,"0.03 in/hr"]
["Soil Infiltration Rate (permeability)",null,null,"in/hr",{"$f":"'1. ENTER DATA'!E53","v":0.2},{"$f":"'1. ENTER DATA'!F53","v":0.2},{"$f":"'1. ENTER DATA'!G53","v":0.2},{"$f":"'1. ENTER DATA'!H53","v":0.2}]
[]
["1. Volume Unknown to User, Use All Routed Volume, Calculate Area"]
["WQV",null,null,"in",{"$f":"'1. ENTER DATA'!E44","v":2.5},{"$f":"'1. ENTER DATA'!F44","v":2.5},{"$f":"'1. ENTER DATA'!G44","v":2.5},{"$f":"'1. ENTER DATA'!H44","v":2.5}]
["Corresponding Yearly Volume infiltrated ",null,null,"in/yr",{"$f":"'1. ENTER DATA'!E45","v":1.1839627863340727},{"$f":"'1. ENTER DATA'!F45","v":0},{"$f":"'1. ENTER DATA'!G45","v":0},{"$f":"'1. ENTER DATA'!H45","v":0}]
["Max Infiltrated Volume per event",null,null,"ft^3",{"$f":"E11*E4*3630","v":9075},{"$f":"F11*F4*3630","v":9075},9075,9075]
["Field Area",null,null,"Acres",{"$f":"E13/(E$8*E$7*3630)","v":0.41666666666666669},{"$f":"F13/(F$8*F$7*3630)","v":0.41666666666666669},0.41666666666666669,0.41666666666666669]
[]
["2. Volume Known and User-Input, Calculate Area"]
["Corresponding WQV",null,null,"in",{"$f":"'1. ENTER DATA'!E48","v":0},{"$f":"'1. ENTER DATA'!F48","v":0},{"$f":"'1. ENTER DATA'!G48","v":0},{"$f":"'1. ENTER DATA'!H48","v":0}]
["Corresponding Yearly Volume infiltrated ",null,null,"in/yr",{"$f":"LOOKUP(E17,'5.CALCS_Adams&Papa'!$A$62:$A$1062,'5.CALCS_Adams&Papa'!B$62:B$1062)","v":0},{"$f":"LOOKUP(F17,'5.CALCS_Adams&Papa'!$A$62:$A$1062,'5.CALCS_Adams&Papa'!C$62:C$1062)","v":0},{"$f":"LOOKUP(G17,'5.CALCS_Adams&Papa'!$A$62:$A$1062,'5.CALCS_Adams&Papa'!D$62:D$1062)","v":0},{"$f":"LOOKUP(H17,'5.CALCS_Adams&Papa'!$A$62:$A$1062,'5.CALCS_Adams&Papa'!E$62:E$1062)","v":0}]
["Max Infiltrated Volume per event",null,null,"ft^3",{"$f":"E17*E4*3630","v":0},{"$f":"F17*F4*3630","v":0},0,0]
["Field Area",null,null,"Acres",{"$f":"E19/(E$8*E$7*3630)","v":0},{"$f":"F19/(F$8*F$7*3630)","v":0},{"$f":"G19/(G$8*G$7*3630)","v":0},{"$f":"H19/(H$8*H$7*3630)","v":0}]
[]
["3. Area Known, Calculate Volume"]
["Corresponding WQV",null,null,"in",{"$f":"E25/DA_A/3630","v":0},{"$f":"F25/DA_B/3630","v":0},{"$f":"G25/DA_C/3630","v":0},{"$f":"H25/DA_D/3630","v":0}]
["Corresponding Yearly Volume Infiltrated",null,null,"in/yr",{"$f":"LOOKUP(E23,'5.CALCS_Adams&Papa'!$A$62:$A$1062,'5.CALCS_Adams&Papa'!B$62:B$1062)","v":0},{"$f":"LOOKUP(F23,'5.CALCS_Adams&Papa'!$A$62:$A$1062,'5.CALCS_Adams&Papa'!C$62:C$1062)","v":0},{"$f":"LOOKUP(G23,'5.CALCS_Adams&Papa'!$A$62:$A$1062,'5.CALCS_Adams&Papa'!D$62:D$1062)","v":0},{"$f":"LOOKUP(H23,'5.CALCS_Adams&Papa'!$A$62:$A$1062,'5.CALCS_Adams&Papa'!E$62:E$1062)","v":0}]
["Max Infiltrated Volume per event",null,null,"ft^3",{"$f":"E26*E$8*E$7*3630","v":0},{"$f":"F26*F$8*F$7*3630","v":0},{"$f":"G26*G$8*G$7*3630","v":0},{"$f":"H26*H$8*H$7*3630","v":0}]
["Field Area",null,null,"Acres",{"$f":"'1. ENTER DATA'!E56","v":0},{"$f":"'1. ENTER DATA'!F56","v":0},{"$f":"'1. ENTER DATA'!G56","v":0},{"$f":"'1. ENTER DATA'!H56","v":0}]
["Sufficient Field Area Provided?",null,null,null,{"$f":"IF(E26>=E14,\"Yes\",\"No\")","v":"No"},{"$f":"IF(F26>=F14,\"Yes\",\"No\")","v":"No"},{"$f":"IF(G26>=G14,\"Yes\",\"No\")","v":"No"},{"$f":"IF(H26>=H14,\"Yes\",\"No\")","v":"No"}]
[]
["4. Minimum Volume Known, Calculate Minimum Area"]
["Yearly Volume infiltrated ",null,null,"Ac-in/yr",{"$f":"ROUNDUP('3. CALCS_Loads'!V172,2)","v":0.53},{"$f":"ROUNDUP('3. CALCS_Loads'!W172,2)","v":0},{"$f":"ROUNDUP('3. CALCS_Loads'!X172,2)","v":0},{"$f":"ROUNDUP('3. CALCS_Loads'!Y172,2)","v":0}]
{"$rows_left_out":10}
{"sheet":"5.CALCS_Adams&Papa","index":4,"n_rows":1062,"n_cols":11,"rows_kept":1062,"cut":false,"hidden":false,"merged":[[0,0,0,12]]}
["ADAMS & PAPA FOR VOLUMETRIC STORMWATER CONTROL MEASURE"]
[]
["Rainfall Statistics"]
["Parameter","Symbol","Value"]
["Mean annual rainfall event volume (in.)","v",{"$f":"'3. CALCS_Loads'!$A$2/'3. CALCS_Loads'!$A$3","v":0.39997478885667465}]
["Mean annual rainfall event duration (hr)","t",5.77]
["Mean annual rainfall event intensity (in/hr)","i",8.3000000000000004E-2]
["Delta = Time interval between storm event midpoints (hr)","Δ",109.4,null,"='5.CALCS_Adams&Papa'!B53*C75*C141"]
["Interevent time, b (hr) - Figure 4.2 in A&P","b",{"$f":"$C$8-$C$6","v":103.63000000000001}]
["Minimum Interevent Time (hr)","IETD",6]
["Psi = 1/(b - IETD)  but using simpler 1/b (1/hr)","y",{"$f":"1/C9","v":9.6497153333976633E-3}]
["Theta = avg. annual number of rainfall events","θ",{"$f":"'3. CALCS_Loads'!A3","v":79.33}]
["Average Annual total rainfall (in.)","P",{"$f":"'3. CALCS_Loads'!A2","v":31.73}]
["Zeta = 1/mean rainfall event volume (1/in)","z",{"$f":"1/v","v":2.5001575795776869}]
["Lambda = 1/mean rainfall event duration (1/hr)","l",{"$f":"1/t","v":0.1733102253032929}]
[]
["Drainage Area","Drainage Area A","Drainage Area B","Drainage Area C","Drainage Area D",null,"Drainage Area A","Drainage Area B","Drainage Area C","Drainage Area D"]
[]
["DRAINAGE AREA CHARACTERISTICS"]
["Drainage Area (acres) DA",{"$f":"'1. ENTER DATA'!E17","v":1},{"$f":"'1. ENTER DATA'!F17","v":1},{"$f":"'1. ENTER DATA'!G17","v":1},{"$f":"'1. ENTER DATA'!H17","v":1},null,{"$f":"DA_A","v":1},{"$f":"DA_B","v":1},{"$f":"DA_C","v":1},{"$f":"DA_D","v":1}]
["Runoff Coefficient Rv",{"$f":"RvA_d","v":6.4399999999999999E-2},{"$f":"RvB_d","v":6.4399999999999999E-2},{"$f":"RvC_d","v":6.4399999999999999E-2},{"$f":"RvD_d","v":6.4399999999999999E-2},null,{"$f":"RvA_d","v":6.4399999999999999E-2},{"$f":"RvB_d","v":6.4399999999999999E-2},{"$f":"RvC_d","v":6.4399999999999999E-2},{"$f":"RvD_d","v":6.4399999999999999E-2}]
["Depression Storage, Sd (in.)",{"$f":"SdA_d","v":0.21809999999999999},{"$f":"SdB_d","v":0.21809999999999999},{"$f":"SdC_d","v":0.21809999999999999},{"$f":"SdD_d","v":0.21809999999999999},null,{"$f":"SdA_d","v":0.21809999999999999},{"$f":"SdB_d","v":0.21809999999999999},{"$f":"SdC_d","v":0.21809999999999999},{"$f":"SdD_d","v":0.21809999999999999}]
[]
["SCM 1 (First in Series) Type",{"$f":"'1. ENTER DATA'!E26","v":"Retention Basin"},{"$f":"'1. ENTER DATA'!F26","v":"Retention Basin"},{"$f":"'1. ENTER DATA'!G26","v":"Retention Basin"},{"$f":"'1. ENTER DATA'!H26","v":"Retention Basin"},null,"Sed/Fil Std","Sed/Fil Std","Sed/Fil Std","Sed/Fil Std"]
["Water Quality Volume (in.)",{"$f":"WQV_A1","v":2.5},{"$f":"WQV_B1","v":2.5},{"$f":"WQV_C1","v":2.5},{"$f":"WQV_D1","v":2.5},null,{"$f":"0.5+(ICA_d-20)/10*0.1","v":0.3},{"$f":"0.5+(ICB_d-20)/10*0.1","v":0.3},{"$f":"0.5+(ICC_d-20)/10*0.1","v":0.3},{"$f":"0.5+(ICD_d-20)/10*0.1","v":0.3}]
["Design Drawdown Time (hr), DDT",{"$f":"DDT_A1","v":60},{"$f":"DDT_B1","v":60},{"$f":"DDT_C1","v":60},{"$f":"DDT_D1","v":60},null,48,48,48,48]
["Effective Drawdown Time (add lag time) (hr), tD",{"$f":"B26+'1. ENTER DATA'!E39","v":72},{"$f":"C26+'1. ENTER DATA'!F39","v":72},{"$f":"D26+'1. ENTER DATA'!G39","v":72},{"$f":"E26+'1. ENTER DATA'!H39","v":72},null,{"$f":"G26","v":48},{"$f":"H26","v":48},48,{"$f":"J26","v":48}]
[]
["AVERAGE ANNUAL RUNOFF CAPTURE ANALYSIS"]
["Design Treatment Rate (in/hr)",{"$f":"B25/B27","v":3.4722222222222224E-2},{"$f":"C25/C27","v":3.4722222222222224E-2},3.4722222222222224E-2,3.4722222222222224E-2,null,6.2499999999999995E-3,6.2499999999999995E-3,6.2499999999999995E-3,6.2499999999999995E-3]
{"$rows_left_out":1032}