{"text_format":"1","workbook":"xlsx","n_sheets":11,"sheets":["Summary","Dev Exp Cost Comparison","MFI&FMR","Instructions","Project Overview","Development Costs","Sources & Uses","Unit Mix, Sales Data","Budget Draw Monitoring ","Prelim Profit & Loss","Working Profit & Loss"],"not_rendered":{"charts":1,"images":1,"macros":0,"external_links":0,"defined_names":25,"comments":2,"pivot_tables":0},"unopened":[],"bounds":{"document_bytes":16777216,"sheet_cells":100000,"rows_first":2000,"rows_last":500,"rows_between":2000,"halvings":0,"cell_chars":16384,"cell_head_chars":4096},"cells_cut":0,"cells_raw":0,"read":"whole","date_system":"1900"}

{"sheet":"Summary","index":0,"n_rows":79,"n_cols":9,"rows_kept":79,"cut":false,"hidden":true,"merged":[[37,5,37,6],[33,5,33,6],[35,5,35,6],[2,6,2,7],[1,1,1,7],[6,6,6,7],[6,1,6,4],[18,1,18,7],[27,5,27,6],[61,6,61,8],[46,1,46,4],[60,1,60,4],[54,6,54,7],[46,6,46,7],[40,5,40,6],[41,5,41,6],[42,5,42,6],[38,5,38,6],[39,5,39,6],[44,5,44,6],[30,5,30,6],[32,5,32,6],[19,5,19,6],[20,5,20,6],[21,5,21,6],[22,5,22,6],[23,5,23,6],[24,5,24,6],[34,5,34,6],[28,5,28,6],[31,5,31,6],[29,5,29,6],[25,5,25,6],[26,5,26,6],[36,5,36,6]]}
[]
[null,"PROJECT SUMMARY INFORMATION"]
[null,"Property (Project) Name:",{"$f":"'Project Overview'!C5","v":0},null,null,"Borrower (Legal Entity) Name:",{"$f":"'Project Overview'!G7","v":0}]
[null,"Street Address:",{"$f":"'Project Overview'!C7","v":0}]
[null,"Developer (Sponsor):",{"$f":"'Project Overview'!G5","v":0}]
[]
[null,"PRELIMINARY PROJECT ANALYSIS",null,null,null,null,"ADDITIONAL DETAILS"]
[null,"Metrics","Proforma","Target Range","Comments",null,"Item","Detail"]
[null," Stabilized DCR (Year 1)",{"$f":"#REF!","v":{"$error":"#REF!"}},{"$f":"TEXT(Summary!$H$64,\"0.00\")&\" - \"&TEXT(Summary!$I$64, \"0.00\")","v":"1.10 - 1.25"},{"$f":"IF(OR(C9=\"0.00\",C9=\"NHD\"),\"N/A\",IF(AND(Summary!$H$64<=C9,C9<=Summary!$I$64),\"OK\",\"Needs Review\"))","v":{"$error":"#REF!"}},null,"HDA Subsidy Requested",{"$f":"'Sources & Uses'!#REF!","v":{"$error":"#REF!"}}]
[null,"Lowest DCR (Years 1-20)",{"$f":"IF(MIN(#REF!)=0,\"NHD\",MIN(#REF!))","v":{"$error":"#REF!"}},{"$f":"TEXT(Summary!$H$64,\"0.00\")&\" - \"&TEXT(Summary!$I$64, \"0.00\")","v":"1.10 - 1.25"},{"$f":"IF(OR(C10=\"0.00\",C10=\"NHD\"),\"N/A\",IF(AND(Summary!$H$64<=C10,C10<=Summary!$I$64),\"OK\",\"Needs Review\"))","v":{"$error":"#REF!"}},null,"Original Application Date",{"$f":"'Unit Mix, Sales Data'!#REF!","v":{"$error":"#REF!"}}]
{"$rows_left_out":70}
{"sheet":"Dev Exp Cost Comparison","index":1,"n_rows":63,"n_cols":7,"rows_kept":63,"cut":false,"hidden":true,"merged":[[1,1,1,6]]}
[]
[null,"Development Expense Comparison"]
[null,"Cost Per Unit","Industry Cost Per Unit","Cost Per Unit Comparison","Cost Per Sq Ft","Industry Cost Per Sq ft","Cost Per Sq Ft Comparison"]
[]
[null,{"$f":"#REF!/Total_Units","v":{"$error":"#REF!"}},null,{"$f":"C5-B5","v":{"$error":"#REF!"}},{"$f":"#REF!/'Unit Mix, Sales Data'!$H$28","v":{"$error":"#REF!"}},null,{"$f":"F5-E5","v":{"$error":"#REF!"}}]
[null,{"$f":"#REF!/Total_Units","v":{"$error":"#REF!"}},null,{"$error":"#REF!"},{"$f":"#REF!/'Unit Mix, Sales Data'!$H$28","v":{"$error":"#REF!"}},null,{"$error":"#REF!"}]
[null,{"$f":"#REF!/Total_Units","v":{"$error":"#REF!"}},null,{"$error":"#REF!"},{"$f":"#REF!/'Unit Mix, Sales Data'!$H$28","v":{"$error":"#REF!"}},null,{"$error":"#REF!"}]
[null,{"$f":"#REF!/Total_Units","v":{"$error":"#REF!"}},null,{"$error":"#REF!"},{"$f":"#REF!/'Unit Mix, Sales Data'!$H$28","v":{"$error":"#REF!"}},null,{"$error":"#REF!"}]
[null,{"$f":"#REF!/Total_Units","v":{"$error":"#REF!"}},null,{"$error":"#REF!"},{"$f":"#REF!/'Unit Mix, Sales Data'!$H$28","v":{"$error":"#REF!"}},null,{"$error":"#REF!"}]
[null,{"$f":"#REF!/Total_Units","v":{"$error":"#REF!"}},null,{"$error":"#REF!"},{"$f":"#REF!/'Unit Mix, Sales Data'!$H$28","v":{"$error":"#REF!"}},null,{"$error":"#REF!"}]
{"$rows_left_out":54}
{"sheet":"MFI&FMR","index":2,"n_rows":16,"n_cols":17,"rows_kept":16,"cut":false,"hidden":true,"merged":[[2,1,2,9],[3,2,3,9]]}
[]
[null,"Source:","HUD User FY24 Income Limits",null,null,"Area:"," Austin-Round Rock, TX MSA",null,null,null,null,"Source:","HUD User FY25 Fair Market Rent (FMR)",null,null,"Area:","Austin-Round Rock, TX MSA"]
[null,"Income by % of Median Family Income (MFI) and Number of Persons in Family"]
[null,null,"Persons in Family"]
[null,"MFI Level",1,2,3,4,5,6,7,8]
[null,0.3,{"$f":"ROUND(($F6*C$16)/50, 0)*50","v":26450},30250,34000,{"$f":"ROUND((F$13*$B6)/50, 0)*50","v":37800},{"$f":"ROUND(($F6*G$16)/50, 0)*50","v":40800},43850,46850,49900]
[null,0.4,35300,40300,45350,{"$f":"ROUND((F$13*$B7)/50, 0)*50","v":50400},54450,58450,62500,66550]
[null,0.5,44100,50400,56700,63000,68050,73100,78100,83150,null,null,null,null,null,"Small Area FMRs by Zip Code can be found here:","HUD User FY25 Small Area Fair Market Rent (FMR)"]
[null,0.6,52900,60500,68050,{"$f":"ROUND((F$13*$B9)/50, 0)*50","v":75600},81650,87700,93750,99800,null,null,null,null,null,"Current Project Zip Code:",{"$f":"'Unit Mix, Sales Data'!#REF!","v":{"$error":"#REF!"}}]
[null,0.7,61750,70550,79400,{"$f":"ROUND((F$13*$B10)/50, 0)*50","v":88200},95250,102300,109350,116400]
{"$rows_left_out":7}
{"sheet":"Instructions","index":3,"n_rows":293,"n_cols":19,"rows_kept":293,"cut":false,"hidden":false,"merged":[[35,14,35,15],[37,13,37,14]]}
[]
[null,null,"Housing Development Assistance Excel Document Instructions",null,null,null,null,null,null,null,null,null,null,null,null,null,null,"North Lamar Blvd",1.01]
[null,null,"1) Fill in each light orange box, if applicable. ",null,null,null,null,null,null,null,null,null,null,null,null,"40 years",null,"Burnet Rd",1.02]
[null,null,"2) Breakout each funding source, pro-forma and development expense with a description.",null,null,null,null,null,null,null,null,null,null,null,null,"45 years",null,"Airport Blvd",2.0299999999999998]
[null,null,"3) Let staff know if you have formula errors or other issues with this spreadsheet.",null,null,null,null,"100% Affordable",null,null,null,null,null,null,null,"50 years",null,"East MLK/FM 969",2.04]
[null,null,"4) Once completed, attach it to the portal below",null,null,null,null,"Mixed-Income",null,null,null,null,null,null,null,"55 years",null,"South Lamar Blvd",2.0499999999999998]
[null,null," Housing Development Assistance Application Submittal Portal ",null,null,null,null,null,null,null,null,null,null,null,null,"60 years",null,"East Riverside Dr",2.06]
[null,null,null,null,null,null,null,"New Construction ",null,null,null,null,null,null,null,"65 years",null,"Guadalupe St",3.02]
[null,null,null,null,null,null,null,"Rehabilitation",null,null,null,"1/4 mile",null,null,null,"70 years",null,"William Cannon Dr",3.04]
[null,null,null,null,null,null,null,null,null,null,null,"1/2 mile",null,null,null,"75 years",null,"Slaughter Ln",3.05]
{"$rows_left_out":284}
{"sheet":"Project Overview","index":4,"n_rows":515,"n_cols":23,"rows_kept":515,"cut":false,"hidden":false,"merged":[[499,1,499,3],[19,1,19,2],[1,1,1,6],[44,18,44,19],[46,17,46,18],[3,1,3,2],[3,5,3,6],[9,5,9,6],[20,5,20,6],[21,5,26,6],[5,1,5,2],[10,1,10,2],[17,1,17,2],[30,1,30,3]]}
[]
[null,"OHDA Application for Gap Financing"]
[]
[null,"Project Information",null,null,null,"Developer Information"]
[null,"Project Name",null,null,null,"Developer Name"]
[null,null,null,null,null,"Co-Developer (If applicable)",null,null,null,null,null,null,null,null,null,null,null,null,null,"40 years",null,"Burnet Rd",1.02]
[null,"Development Street Address",null,null,null,"Borrower (Legal Entity) Name"]
[null,"City, State","Austin, TX",null,null,"Developer Type (For or Non-Profit)"]
[null,"Development Zip Code"]
[null,"County",null,null,null,"Transaction Contact Information"]
{"$rows_left_out":506}
{"sheet":"Development Costs","index":5,"n_rows":150,"n_cols":17,"rows_kept":150,"cut":false,"hidden":false,"merged":[[153,1,153,3],[150,1,150,3],[145,2,145,3],[146,2,146,3],[147,2,147,3],[5,1,5,3],[5,5,5,6],[72,1,72,3],[72,5,72,6],[7,5,7,6],[8,5,8,6],[15,5,15,6],[16,5,16,6],[48,5,48,6],[48,1,48,3],[16,1,16,3],[15,1,15,3],[27,5,27,6],[27,1,27,3],[42,5,42,6],[42,1,42,3],[105,5,105,6],[130,1,130,3],[130,5,130,6],[107,5,107,6],[107,1,107,3],[118,5,118,6],[118,1,118,3],[106,5,106,6],[106,1,106,3],[73,1,73,3],[73,5,73,6],[77,1,77,3],[85,1,85,3],[85,5,85,6],[82,5,82,6],[84,1,84,3],[84,5,84,6],[75,5,75,6],[76,1,76,3],[77,5,77,6],[82,1,82,3],[141,1,141,3],[126,5,126,6],[126,1,126,3],[133,5,133,6],[133,1,133,3],[141,5,141,6],[142,1,142,3],[143,2,143,3],[144,2,144,3],[151,1,151,3],[149,5,152,6],[152,1,152,3]]}
[null,"Is Project Existing Building Acquisition or New Construction/Rehabilitation?",null,null,null,null,null,null,null,null,null,null,null,null,null,null,"Acquisition"]
[null,null,null,null,null,null,null,null,null,null,null,null,null,null,null,null,"New/Rehab"]
[null,"Note: Please provide notes detailing explanations for descrepancies."]
[]
[]
[null,"Development Budget",null,null,null,"Eligible Basis"]
[null,null,"Project Cost","Requested AHFC Funds",null,"Acquisition","New/Rehab"]
[]
[null,"ACQUISITION"]
[null,"Site Acquisition Cost"]
{"$rows_left_out":141}
{"sheet":"Sources & Uses","index":6,"n_rows":31,"n_cols":18,"rows_kept":31,"cut":false,"hidden":false,"merged":[[30,11,30,13],[15,11,15,16],[17,8,17,9],[18,8,18,9],[0,0,1,16],[2,0,2,16],[15,1,15,6],[4,1,4,9],[16,11,16,12],[5,11,5,12],[4,11,4,13]]}
[{"$f":"'Project Overview'!C5","v":0}]
[]
[{"$f":"'Project Overview'!G5","v":0}]
[]
[null,"Sources Breakdown",null,null,null,null,null,null,null,null,null,"Sources",null,null,null,"Developer Fee Percentage "]
[null,"Type of Funds","Source of Funds","Committed?","If No, Additional Details","Interest Rate","Loan Amount","Loan Term (months)","Interest","Total Amount w/ Interest",null,"Financing Sources*",null,"% of Total",null,"Eligible Basis",{"$f":"'Development Costs'!G144","v":0}]
[null,"AHFC Funding Request","AHFC","No","Not Yet Awarded",0,null,60,{"$f":"SUM((50%*G7*F7)/12*H7)","v":0},{"$f":"G7+I7","v":0},null,"Hard Debt",{"$f":"SUMIF($B$7:$B$15, $L7, $J$7:$J$15)","v":0},{"$f":"IF(M7=0,\"\",M7/$M$14)","v":""},null,"Developer Fee",{"$f":"'Development Costs'!C138","v":0}]
[null,null,null,null,null,null,null,null,0,0,null,"Soft Debt",0,{"$f":"IF(M8=0,0,M8/$M$14)","v":0},null,"Eligible Basis Minus Developer Fee",{"$f":"Q6-Q7","v":0}]
[null,null,null,null,null,null,null,null,0,0,null,"Other Loan(s)",0,0,null,"Developer Fee % of Eligible Basis",{"$f":"'Development Costs'!G145","v":{"$error":"#DIV/0!"}},"*cannot be over 15%"]
[null,null,null,null,null,null,null,null,0,0,null,"Grant",0,0,null,"* Developer fee at application must be maintained throughout the development process. A final accounting will occur at project closeout where excess proceeds will be required to pay down AHFC's loan principle."]
{"$rows_left_out":22}
{"sheet":"Unit Mix, Sales Data","index":7,"n_rows":98,"n_cols":32,"rows_kept":98,"cut":false,"hidden":false,"merged":[[58,7,58,8],[60,7,60,8],[42,19,42,22],[28,5,28,6],[27,5,27,6],[29,5,29,6],[30,14,30,15],[57,7,57,8],[52,7,52,8],[59,7,59,8],[46,7,46,8],[47,7,47,8],[48,7,48,8],[49,7,49,8],[32,11,32,16],[33,11,33,16],[55,7,55,8],[56,7,56,8],[51,7,51,8],[8,17,8,23],[43,4,43,8],[39,11,39,16],[40,4,40,8],[32,3,32,9],[1,17,1,23],[2,17,2,23],[50,7,50,8],[53,7,53,8],[54,7,54,8],[1,3,1,15]]}
[]
[null,null,null,"Unit Mix"]
[null,null,"Model Name","Median Family Income (MFI)","Unit Count","Bedrooms","Per Unit Sq Ft","Total Sq Ft Per Unit Type","Cost Per Sq Ft","Total Cost/Unit","Total Cost All Units","Sales Price","Estimated Gross Sales",null,"Sales Price (per current AHFC Pricing)","Estimated Gross Sales"]
[null,{"$f":"IF(D4=\"\",\"\",IF(OR('Project Overview'!$C$13='Project Overview'!$L$41,'Project Overview'!$C$13='Project Overview'!$L$42,'Project Overview'!$C$13='Project Overview'!$L43,'Project Overview'!$L$44,'Project Overview'!$C$13='Project Overview'!$L$45),\"Single Family\",\"Condos\"))","v":""},{"$f":"IF(E4<>\"\", \"Model 1\", \"\")","v":""},null,null,null,null,{"$f":"IF(G4=\"\",\"\",G4*E4)","v":""},{"$f":"IF(D4=\"\",\"\",'Development Costs'!$C$140/'Unit Mix, Sales Data'!$H$28)","v":""},{"$f":"IF(D4=\"\",\"\",G4*I4)","v":""},{"$f":"IF(D4=\"\",\"\",J4*E4)","v":""},null,{"$f":"IF(D4=\"\",\"\",(L4*E4))","v":""},null,{"$f":"IF(OR(D4=\"MKT\", D4=\"Commercial\"), L4, IFERROR(_xlfn.XLOOKUP(1, ($T$45:$T$98=B4)*($U$45:$U$98=D4)*($V$45:$V$98=F4), $W$45:$W$98), 0))","v":0},{"$f":"IF(D4=\"\",\"\",(O4*E4))","v":""}]
[null,{"$f":"IF(D5=\"\",\"\",IF(OR('Project Overview'!$C$13='Project Overview'!$L$41,'Project Overview'!$C$13='Project Overview'!$L$42,'Project Overview'!$C$13='Project Overview'!$L44,'Project Overview'!$L$44,'Project Overview'!$C$13='Project Overview'!$L$45),\"Single Family\",\"Condos\"))","v":""},{"$f":"IF(E5<>\"\", \"Model 2\", \"\")","v":""},null,null,null,null,"",{"$f":"IF(D5=\"\",\"\",'Development Costs'!$C$140/'Unit Mix, Sales Data'!$H$28)","v":""},"","",null,{"$f":"IF(D5=\"\",\"\",(L5*E5))","v":""},null,{"$f":"IF(OR(D5=\"MKT\", D5=\"Commercial\"), L5, IFERROR(_xlfn.XLOOKUP(1, ($T$45:$T$98=B5)*($U$45:$U$98=D5)*($V$45:$V$98=F5), $W$45:$W$98), 0))","v":0},""]
[null,{"$f":"IF(D6=\"\",\"\",IF(OR('Project Overview'!$C$13='Project Overview'!$L$41,'Project Overview'!$C$13='Project Overview'!$L$42,'Project Overview'!$C$13='Project Overview'!$L45,'Project Overview'!$L$44,'Project Overview'!$C$13='Project Overview'!$L$45),\"Single Family\",\"Condos\"))","v":""},{"$f":"IF(E6<>\"\", \"Model 3\", \"\")","v":""},null,null,null,null,"",{"$f":"IF(D6=\"\",\"\",'Development Costs'!$C$140/'Unit Mix, Sales Data'!$H$28)","v":""},"","",null,"",null,{"$f":"IF(OR(D6=\"MKT\", D6=\"Commercial\"), L6, IFERROR(_xlfn.XLOOKUP(1, ($T$45:$T$98=B6)*($U$45:$U$98=D6)*($V$45:$V$98=F6), $W$45:$W$98), 0))","v":0},""]
[null,{"$f":"IF(D7=\"\",\"\",IF(OR('Project Overview'!$C$13='Project Overview'!$L$41,'Project Overview'!$C$13='Project Overview'!$L$42,'Project Overview'!$C$13='Project Overview'!$L46,'Project Overview'!$L$44,'Project Overview'!$C$13='Project Overview'!$L$45),\"Single Family\",\"Condos\"))","v":""},{"$f":"IF(E7<>\"\", \"Model 4\", \"\")","v":""},null,null,null,null,"",{"$f":"IF(D7=\"\",\"\",'Development Costs'!$C$140/'Unit Mix, Sales Data'!$H$28)","v":""},"","",null,"",null,{"$f":"IF(OR(D7=\"MKT\", D7=\"Commercial\"), L7, IFERROR(_xlfn.XLOOKUP(1, ($T$45:$T$98=B7)*($U$45:$U$98=D7)*($V$45:$V$98=F7), $W$45:$W$98), 0))","v":0},""]
[null,{"$f":"IF(D8=\"\",\"\",IF(OR('Project Overview'!$C$13='Project Overview'!$L$41,'Project Overview'!$C$13='Project Overview'!$L$42,'Project Overview'!$C$13='Project Overview'!$L47,'Project Overview'!$L$44,'Project Overview'!$C$13='Project Overview'!$L$45),\"Single Family\",\"Condos\"))","v":""},{"$f":"IF(E8<>\"\", \"Model 5\", \"\")","v":""},null,null,null,null,"",{"$f":"IF(D8=\"\",\"\",'Development Costs'!$C$140/'Unit Mix, Sales Data'!$H$28)","v":""},"","",null,"",null,{"$f":"IF(OR(D8=\"MKT\", D8=\"Commercial\"), L8, IFERROR(_xlfn.XLOOKUP(1, ($T$45:$T$98=B8)*($U$45:$U$98=D8)*($V$45:$V$98=F8), $W$45:$W$98), 0))","v":0},""]
[null,{"$f":"IF(D9=\"\",\"\",IF(OR('Project Overview'!$C$13='Project Overview'!$L$41,'Project Overview'!$C$13='Project Overview'!$L$42,'Project Overview'!$C$13='Project Overview'!$L48,'Project Overview'!$L$44,'Project Overview'!$C$13='Project Overview'!$L$45),\"Single Family\",\"Condos\"))","v":""},{"$f":"IF(E9<>\"\", \"Model 6\", \"\")","v":""},null,null,null,null,"",{"$f":"IF(D9=\"\",\"\",'Development Costs'!$C$140/'Unit Mix, Sales Data'!$H$28)","v":""},"","",null,"",null,{"$f":"IF(OR(D9=\"MKT\", D9=\"Commercial\"), L9, IFERROR(_xlfn.XLOOKUP(1, ($T$45:$T$98=B9)*($U$45:$U$98=D9)*($V$45:$V$98=F9), $W$45:$W$98), 0))","v":0},""]
[null,{"$f":"IF(D10=\"\",\"\",IF(OR('Project Overview'!$C$13='Project Overview'!$L$41,'Project Overview'!$C$13='Project Overview'!$L$42,'Project Overview'!$C$13='Project Overview'!$L49,'Project Overview'!$L$44,'Project Overview'!$C$13='Project Overview'!$L$45),\"Single Family\",\"Condos\"))","v":""},{"$f":"IF(E10<>\"\", \"Model 7\", \"\")","v":""},null,null,null,null,"",{"$f":"IF(D10=\"\",\"\",'Development Costs'!$C$140/'Unit Mix, Sales Data'!$H$28)","v":""},"","",null,"",null,{"$f":"IF(OR(D10=\"MKT\", D10=\"Commercial\"), L10, IFERROR(_xlfn.XLOOKUP(1, ($T$45:$T$98=B10)*($U$45:$U$98=D10)*($V$45:$V$98=F10), $W$45:$W$98), 0))","v":0},""]
{"$rows_left_out":89}
{"sheet":"Budget Draw Monitoring ","index":8,"n_rows":134,"n_cols":37,"rows_kept":134,"cut":false,"hidden":false,"merged":[[117,9,117,36],[6,1,6,7],[74,9,74,36],[94,9,94,36],[95,9,95,36],[105,9,105,36],[112,9,112,36],[5,35,5,36],[23,1,23,7],[37,1,37,7],[42,1,42,7],[68,1,68,7],[13,9,13,36],[12,1,12,7],[13,1,13,7],[6,9,6,36],[12,9,12,36],[23,9,23,36],[37,9,37,36],[42,9,42,36],[68,9,68,36],[0,1,3,1],[0,2,0,3],[5,6,5,7],[1,2,1,31],[2,2,2,31],[3,2,3,31],[5,3,5,4],[4,8,131,8],[112,1,112,7],[74,1,74,7],[94,1,94,7],[95,1,95,7],[105,1,105,7],[123,9,123,36],[123,1,123,7],[117,1,117,7]]}
[null,{"$error":"#VALUE!"}]
[null,null,"SOURCES AND USES"]
[null,null,{"$f":"'Project Overview'!C5","v":0}]
[null,null,{"$f":"'Project Overview'!G5","v":0}]
[null,"Project Uses","Budget","Budget %","Previous Adjustments","Adjustments From Current Draw","Revised Budget","Revised Budget %",null,"Spent to Date / Closing"," Draw 1","Draw 2","Draw 3","Draw 4","Draw 5","Draw 6","Draw 7","Draw 8","Draw 9","Draw 10","Draw 11","Draw 12","Draw 13","Draw 14","Draw 15","Draw 16","Draw 17","Draw 18","Draw 19","Draw 20","Draw 21","Draw 22","Draw 23","Draw 24","Funded To-Date","Percentage Complete","Balance to Fund"]
[null,"Dates",null,null,null,null,null,null,null,null,null,null,null,null,null,null,null,null,null,null,null,null,null,null,null,null,null,null,null,null,null,null,null,null,{"$f":"TODAY()","v":"2025-09-09"}]
[null,"Acquisition"]
[null,"Site Acquisition Cost",{"$f":"'Development Costs'!C10","v":0},{"$f":"IFERROR($C8/$C$123,0)","v":0},null,null,{"$f":"$C8+$E8+$F8","v":0},{"$f":"IFERROR($G8/$G$123,0)","v":0},null,null,null,null,null,null,null,null,null,null,null,null,null,null,null,null,null,null,null,null,null,null,null,null,null,null,{"$f":"SUM($J8:$AH8)","v":0},{"$f":"IFERROR($AI8/$G8,0)","v":0},{"$f":"$G8-$AI8","v":0}]
[null,"Existing Building Acquisition Costs",{"$f":"'Development Costs'!C11","v":0},{"$f":"IFERROR($C9/$C$123,0)","v":0},null,null,{"$f":"$C9+$E9+$F9","v":0},{"$f":"IFERROR($G9/$G$123,0)","v":0},null,null,null,null,null,null,null,null,null,null,null,null,null,null,null,null,null,null,null,null,null,null,null,null,null,null,{"$f":"SUM($J9:$AH9)","v":0},{"$f":"IFERROR($AI9/$G9,0)","v":0},{"$f":"$G9-$AI9","v":0}]
[null,"Closing Costs & Acquisition Legal Fees",{"$f":"'Development Costs'!C12","v":0},{"$f":"IFERROR($C10/$C$123,0)","v":0},null,null,{"$f":"$C10+$E10+$F10","v":0},{"$f":"IFERROR($G10/$G$123,0)","v":0},null,null,null,null,null,null,null,null,null,null,null,null,null,null,null,null,null,null,null,null,null,null,null,null,null,null,{"$f":"SUM($J10:$AH10)","v":0},{"$f":"IFERROR($AI10/$G10,0)","v":0},{"$f":"$G10-$AI10","v":0}]
{"$rows_left_out":125}
{"sheet":"Prelim Profit & Loss","index":9,"n_rows":59,"n_cols":6,"rows_kept":59,"cut":false,"hidden":false,"merged":[[56,1,56,4],[57,1,57,4],[58,1,58,4],[48,1,48,4],[50,1,50,4],[51,1,51,4],[53,1,53,4],[55,1,55,5],[54,2,54,4],[49,1,49,4],[52,1,52,4],[42,1,42,4],[43,1,43,4],[44,1,44,4],[45,1,45,4],[47,1,47,5],[37,1,37,4],[38,1,38,4],[39,1,39,4],[40,1,40,4],[41,1,41,4],[32,1,32,5],[33,1,33,4],[34,1,34,4],[35,1,35,4],[36,1,36,4],[0,1,0,5],[1,1,1,5],[2,1,2,5],[4,1,4,5],[30,1,30,4]]}
[null,{"$f":"IFERROR(IF('Project Overview'!C5=0,\"\"),\"\")","v":""}]
[null,{"$f":"IFERROR(IF('Project Overview'!G5=0,\"\"),\"\")","v":""}]
[null,"Estimated Profit & Loss"]
[]
[null,"REVENUE FROM SALES"]
[null,"Model","Unit Type","Number of Units","Sales Price/Unit","Totals"]
[null,{"$f":"IF('Unit Mix, Sales Data'!D4=\"\",\"\",'Unit Mix, Sales Data'!C4)","v":""},{"$f":"IF('Unit Mix, Sales Data'!D4=\"\",\"\",'Unit Mix, Sales Data'!D4)","v":""},{"$f":"IF('Unit Mix, Sales Data'!E4=\"\",\"\",'Unit Mix, Sales Data'!E4)","v":""},{"$f":"IFERROR('Unit Mix, Sales Data'!L4,0)","v":0},{"$f":"IF(C7=\"\",\"\",SUM(D7*E7))","v":""}]
[null,{"$f":"IF('Unit Mix, Sales Data'!D5=\"\",\"\",'Unit Mix, Sales Data'!C5)","v":""},{"$f":"IF('Unit Mix, Sales Data'!D5=\"\",\"\",'Unit Mix, Sales Data'!D5)","v":""},{"$f":"IF('Unit Mix, Sales Data'!E5=\"\",\"\",'Unit Mix, Sales Data'!E5)","v":""},{"$f":"IFERROR('Unit Mix, Sales Data'!L5,0)","v":0},""]
[null,{"$f":"IF('Unit Mix, Sales Data'!D6=\"\",\"\",'Unit Mix, Sales Data'!C6)","v":""},{"$f":"IF('Unit Mix, Sales Data'!D6=\"\",\"\",'Unit Mix, Sales Data'!D6)","v":""},{"$f":"IF('Unit Mix, Sales Data'!E6=\"\",\"\",'Unit Mix, Sales Data'!E6)","v":""},{"$f":"IFERROR('Unit Mix, Sales Data'!L6,0)","v":0},""]
[null,{"$f":"IF('Unit Mix, Sales Data'!D7=\"\",\"\",'Unit Mix, Sales Data'!C7)","v":""},{"$f":"IF('Unit Mix, Sales Data'!D7=\"\",\"\",'Unit Mix, Sales Data'!D7)","v":""},{"$f":"IF('Unit Mix, Sales Data'!E7=\"\",\"\",'Unit Mix, Sales Data'!E7)","v":""},{"$f":"IFERROR('Unit Mix, Sales Data'!L7,0)","v":0},""]
{"$rows_left_out":50}
{"sheet":"Working Profit & Loss","index":10,"n_rows":68,"n_cols":8,"rows_kept":68,"cut":false,"hidden":false,"merged":[[57,1,57,4],[58,1,58,4],[0,1,0,5],[1,1,1,5],[2,1,2,5],[4,1,4,5],[32,1,32,5],[67,1,69,5],[51,1,51,4],[52,1,52,4],[49,1,49,4],[33,1,33,4],[34,1,34,4],[35,1,35,4],[36,1,36,4],[37,1,37,4],[38,1,38,4],[39,1,39,4],[40,1,40,4],[61,1,61,5],[60,1,60,4],[65,1,65,4],[42,1,42,4],[62,1,62,4],[63,1,63,4],[41,1,41,4],[30,1,30,4],[64,1,64,4],[43,1,43,4],[47,1,47,5],[48,1,48,4],[44,1,44,4],[45,1,45,4],[55,1,55,5],[59,1,59,4],[50,1,50,4],[53,1,53,4],[54,1,54,4],[56,1,56,4]]}
[null,{"$f":"IFERROR(IF('Project Overview'!C5=0,\"\"),\"\")","v":""}]
[null,{"$f":"IFERROR(IF('Project Overview'!G5=0,\"\"),\"\")","v":""}]
[null,"Estimated Profit & Loss"]
[]
[null,"REVENUE FROM SALES"]
[null,"Owner Name","MFI","Unit Number","Sales Price/Unit","Totals"]
[null,null,null,null,null,{"$f":"IF(C7=\"\",\"\",SUM(D7*E7))","v":""}]
[]
[null,null,null,null,null,""]
[null,null,null,null,null,""]
{"$rows_left_out":58}