{"text_format":"1","workbook":"xlsx","n_sheets":11,"sheets":["Summary","Dev Exp Cost Comparison","ProForma Comparision","MFI&FMR","LIHTC Calculator","Instructions","Project Overview","Unit Mix, Income, Timeline","Sources & Uses","Development Costs","ProForma"],"not_rendered":{"charts":0,"images":0,"macros":0,"external_links":0,"defined_names":39,"comments":2,"pivot_tables":0},"unopened":[],"bounds":{"document_bytes":16777216,"sheet_cells":100000,"rows_first":2000,"rows_last":500,"rows_between":2000,"halvings":0,"cell_chars":16384,"cell_head_chars":4096},"cells_cut":0,"cells_raw":0,"read":"whole","date_system":"1900"}

{"sheet":"Summary","index":0,"n_rows":79,"n_cols":9,"rows_kept":79,"cut":false,"hidden":true,"merged":[[44,5,44,6],[30,5,30,6],[32,5,32,6],[19,5,19,6],[20,5,20,6],[21,5,21,6],[22,5,22,6],[23,5,23,6],[24,5,24,6],[34,5,34,6],[28,5,28,6],[31,5,31,6],[29,5,29,6],[25,5,25,6],[26,5,26,6],[36,5,36,6],[40,5,40,6],[41,5,41,6],[42,5,42,6],[38,5,38,6],[39,5,39,6],[61,6,61,8],[46,1,46,4],[60,1,60,4],[54,6,54,7],[46,6,46,7],[37,5,37,6],[33,5,33,6],[35,5,35,6],[2,6,2,7],[1,1,1,7],[6,6,6,7],[6,1,6,4],[18,1,18,7],[27,5,27,6]]}
[]
[null,"PROJECT SUMMARY INFORMATION"]
[null,"Property (Project) Name:",{"$f":"'Project Overview'!C6","v":0},null,null,"Borrower (Legal Entity) Name:",{"$f":"'Project Overview'!G8","v":0}]
[null,"Street Address:",{"$f":"'Project Overview'!C8","v":0}]
[null,"Developer (Sponsor):",{"$f":"'Project Overview'!G6","v":0}]
[]
[null,"PRELIMINARY PROJECT ANALYSIS",null,null,null,null,"ADDITIONAL DETAILS"]
[null,"Metrics","Proforma","Target Range","Comments",null,"Item","Detail"]
[null," Stabilized DCR (Year 1)",{"$f":"#REF!","v":{"$error":"#REF!"}},{"$f":"TEXT(Summary!$H$64,\"0.00\")&\" - \"&TEXT(Summary!$I$64, \"0.00\")","v":"1.10 - 1.25"},{"$f":"IF(OR(C9=\"0.00\",C9=\"NHD\"),\"N/A\",IF(AND(Summary!$H$64<=C9,C9<=Summary!$I$64),\"OK\",\"Needs Review\"))","v":{"$error":"#REF!"}},null,"HDA Subsidy Requested",{"$f":"'Sources & Uses'!K15","v":0}]
[null,"Lowest DCR (Years 1-20)",{"$f":"IF(MIN(#REF!)=0,\"NHD\",MIN(#REF!))","v":{"$error":"#REF!"}},{"$f":"TEXT(Summary!$H$64,\"0.00\")&\" - \"&TEXT(Summary!$I$64, \"0.00\")","v":"1.10 - 1.25"},{"$f":"IF(OR(C10=\"0.00\",C10=\"NHD\"),\"N/A\",IF(AND(Summary!$H$64<=C10,C10<=Summary!$I$64),\"OK\",\"Needs Review\"))","v":{"$error":"#REF!"}},null,"Original Application Date",{"$f":"'Unit Mix, Income, Timeline'!#REF!","v":{"$error":"#REF!"}}]
{"$rows_left_out":70}
{"sheet":"Dev Exp Cost Comparison","index":1,"n_rows":63,"n_cols":7,"rows_kept":63,"cut":false,"hidden":true,"merged":[[1,1,1,6]]}
[]
[null,"Development Expense Comparison"]
[null,"Cost Per Unit","Industry Cost Per Unit","Cost Per Unit Comparison","Cost Per Sq Ft","Industry Cost Per Sq ft","Cost Per Sq Ft Comparison"]
[]
[null,{"$f":"'Development Costs'!C5/Total_Units","v":{"$error":"#DIV/0!"}},null,{"$f":"C5-B5","v":{"$error":"#DIV/0!"}},{"$f":"'Development Costs'!C5/'Unit Mix, Income, Timeline'!$G$28","v":{"$error":"#DIV/0!"}},null,{"$f":"F5-E5","v":{"$error":"#DIV/0!"}}]
[null,{"$f":"'Development Costs'!C6/Total_Units","v":{"$error":"#DIV/0!"}},null,{"$error":"#DIV/0!"},{"$f":"'Development Costs'!C6/'Unit Mix, Income, Timeline'!$G$28","v":{"$error":"#DIV/0!"}},null,{"$error":"#DIV/0!"}]
[null,{"$f":"'Development Costs'!C7/Total_Units","v":{"$error":"#DIV/0!"}},null,{"$error":"#DIV/0!"},{"$f":"'Development Costs'!C7/'Unit Mix, Income, Timeline'!$G$28","v":{"$error":"#DIV/0!"}},null,{"$error":"#DIV/0!"}]
[null,{"$f":"'Development Costs'!C8/Total_Units","v":{"$error":"#DIV/0!"}},null,{"$error":"#DIV/0!"},{"$f":"'Development Costs'!C8/'Unit Mix, Income, Timeline'!$G$28","v":{"$error":"#DIV/0!"}},null,{"$error":"#DIV/0!"}]
[null,{"$f":"'Development Costs'!C9/Total_Units","v":{"$error":"#DIV/0!"}},null,{"$error":"#DIV/0!"},{"$f":"'Development Costs'!C9/'Unit Mix, Income, Timeline'!$G$28","v":{"$error":"#DIV/0!"}},null,{"$error":"#DIV/0!"}]
[null,{"$f":"'Development Costs'!C10/Total_Units","v":{"$error":"#DIV/0!"}},null,{"$error":"#DIV/0!"},{"$f":"'Development Costs'!C10/'Unit Mix, Income, Timeline'!$G$28","v":{"$error":"#DIV/0!"}},null,{"$error":"#DIV/0!"}]
{"$rows_left_out":54}
{"sheet":"ProForma Comparision","index":2,"n_rows":20,"n_cols":10,"rows_kept":20,"cut":false,"hidden":true,"merged":[[2,1,2,9]]}
[]
[]
[null,"Year 1 Annual Operating Expense Assumptions"]
[null,"Expense Item","Annual Amount","Exp. Per Unit",null,"Industry Exp. Per Unit","Exp. Per Unit Comparison","Exp. Per Sq Ft","Industry Exp Per Sq ft","Exp. Per Sq Ft Comparison"]
[null,"General & Administrative",{"$f":"ProForma!C4","v":0},{"$error":"#DIV/0!"},null,null,{"$f":"D5-F5","v":{"$error":"#DIV/0!"}},{"$f":"C5/'Unit Mix, Income, Timeline'!$G$28","v":{"$error":"#DIV/0!"}},null,{"$f":"H5-I5","v":{"$error":"#DIV/0!"}}]
[null,"Management Fee",{"$f":"ProForma!C5","v":0},{"$error":"#DIV/0!"},null,null,{"$f":"D6-F6","v":{"$error":"#DIV/0!"}},{"$f":"C6/'Unit Mix, Income, Timeline'!$G$28","v":{"$error":"#DIV/0!"}},null,{"$f":"H6-I6","v":{"$error":"#DIV/0!"}}]
[null,"Management Fee % of Total Rent",{"$f":"C6/(SUM('ProForma Comparision'!#REF!))","v":{"$error":"#REF!"}}]
[null,"Employee Payroll",{"$f":"ProForma!C7","v":0},{"$f":"C8/Total_Units","v":{"$error":"#REF!"}},null,null,{"$f":"D8-F8","v":{"$error":"#REF!"}},{"$f":"C8/'Unit Mix, Income, Timeline'!$G$28","v":{"$error":"#DIV/0!"}},null,{"$f":"H8-I8","v":{"$error":"#DIV/0!"}}]
[null,"Repairs & Maintenance",{"$f":"ProForma!C8","v":0},{"$error":"#REF!"},null,null,{"$error":"#REF!"},{"$f":"C9/'Unit Mix, Income, Timeline'!$G$28","v":{"$error":"#DIV/0!"}},null,{"$error":"#DIV/0!"}]
[null,"Contracted Services",{"$f":"ProForma!C9","v":0},{"$error":"#REF!"},null,null,{"$error":"#REF!"},{"$f":"C10/'Unit Mix, Income, Timeline'!$G$28","v":{"$error":"#DIV/0!"}},null,{"$error":"#DIV/0!"}]
{"$rows_left_out":11}
{"sheet":"MFI&FMR","index":3,"n_rows":45,"n_cols":17,"rows_kept":45,"cut":false,"hidden":true,"merged":[[2,11,2,16],[3,12,3,16],[44,5,44,6],[35,8,35,9],[36,8,36,9],[37,8,37,9],[38,8,38,9],[39,8,39,9],[40,8,40,9],[41,8,41,9],[42,8,42,9],[43,8,43,9],[38,5,38,6],[39,5,39,6],[42,5,42,6],[43,5,43,6],[44,8,44,9],[32,2,32,9],[35,5,35,6],[36,5,36,6],[37,5,37,6],[40,5,40,6],[41,5,41,6],[2,1,2,9],[31,1,31,9],[18,2,18,9],[34,5,34,6],[3,2,3,9],[17,1,17,9],[34,8,34,9],[33,8,33,9],[33,5,33,6]]}
[]
[null,"Source:","HUD User FY24 Income Limits",null,null,"Area:"," Austin-Round Rock, TX MSA",null,null,null,null,"Source:","HUD User FY25 Fair Market Rent (FMR)",null,null,"Area:","Austin-Round Rock, TX MSA"]
[null,"Income by % of Median Family Income (MFI) and Number of Persons in Family",null,null,null,null,null,null,null,null,null," MSA Fair Market Rents (FMRs) By Unit Bedrooms"]
[null,null,"Persons in Family",null,null,null,null,null,null,null,null,null,"Bedrooms"]
[null,"MFI Level",1,2,3,4,5,6,7,8,null,"Year",0,1,2,3,4]
[null,0.3,{"$f":"ROUND(($F6*C$16)/50, 0)*50","v":26450},30250,34000,{"$f":"ROUND((F$13*$B6)/50, 0)*50","v":37800},{"$f":"ROUND(($F6*G$16)/50, 0)*50","v":40800},43850,46850,49900,null,"FY 2025",1549,1650,1949,2484,2882]
[null,0.4,35300,40300,45350,{"$f":"ROUND((F$13*$B7)/50, 0)*50","v":50400},54450,58450,62500,66550]
[null,0.5,44100,50400,56700,63000,68050,73100,78100,83150,null,null,null,null,null,"Small Area FMRs by Zip Code can be found here:","HUD User FY25 Small Area Fair Market Rent (FMR)"]
[null,0.6,52900,60500,68050,{"$f":"ROUND((F$13*$B9)/50, 0)*50","v":75600},81650,87700,93750,99800,null,null,null,null,null,"Current Project Zip Code:",{"$f":"'Unit Mix, Income, Timeline'!#REF!","v":{"$error":"#REF!"}}]
[null,0.7,61750,70550,79400,{"$f":"ROUND((F$13*$B10)/50, 0)*50","v":88200},95250,102300,109350,116400]
{"$rows_left_out":36}
{"sheet":"LIHTC Calculator","index":4,"n_rows":28,"n_cols":3,"rows_kept":28,"cut":false,"hidden":true,"merged":[[1,1,1,2],[3,1,3,2],[8,1,8,2],[18,1,18,2]]}
[]
[null,"LIHTC Estimate Calculation"]
[]
[null,"LIHTC Eligible Basis"]
[null,"Eligible Development Costs",{"$f":"'Development Costs'!F63","v":0}]
[null,"Additional Ineligible (Grants, Other)"]
[null,"Total LIHTC Eligible Basis:",{"$f":"SUM(C5:C6)","v":0}]
[]
[null,"Applicable Fraction Method"]
[null,"Total LIHTC Units",{"$f":"'Unit Mix, Income, Timeline'!C29","v":0}]
{"$rows_left_out":19}
{"sheet":"Instructions","index":5,"n_rows":293,"n_cols":19,"rows_kept":293,"cut":false,"hidden":false,"merged":[[35,14,35,15],[37,13,37,14]]}
[]
[null,null,"Housing Development Assistiance Excel Document Instructions",null,null,null,null,null,null,null,null,null,null,null,null,null,null,"North Lamar Blvd",1.01]
[null,null,"1) Fill in each light beige box, if applicable. ",null,null,null,null,null,null,null,null,null,null,null,null,"40 years",null,"Burnet Rd",1.02]
[null,null,"2) Breakout each funding source, pro-forma and development expense with a description.",null,null,null,null,null,null,null,null,null,null,null,null,"45 years",null,"Airport Blvd",2.0299999999999998]
[null,null,"3) Let staff know if you have formula errors or other issues with this spreadsheet.",null,null,null,null,"100% Affordable",null,null,null,null,null,null,null,"50 years",null,"East MLK/FM 969",2.04]
[null,null,"4) Once completed, attach it to the portal below",null,null,null,null,"Mixed-Income",null,null,null,null,null,null,null,"55 years",null,"South Lamar Blvd",2.0499999999999998]
[null,null," Housing Development Assistance Application Submittal Portal ",null,null,null,null,null,null,null,null,null,null,null,null,"60 years",null,"East Riverside Dr",2.06]
[null,null,null,null,null,null,null,"New Construction ",null,null,null,null,null,null,null,"65 years",null,"Guadalupe St",3.02]
[null,null,null,null,null,null,null,"Rehabilitation",null,null,null,"1/4 mile",null,null,null,"70 years",null,"William Cannon Dr",3.04]
[null,null,null,null,null,null,null,null,null,null,null,"1/2 mile",null,null,null,"75 years",null,"Slaughter Ln",3.05]
{"$rows_left_out":284}
{"sheet":"Project Overview","index":6,"n_rows":307,"n_cols":23,"rows_kept":307,"cut":false,"hidden":false,"merged":[[23,5,23,6],[1,1,1,6],[49,18,49,19],[51,17,51,18],[3,1,3,2],[3,5,3,6],[15,5,15,6],[17,6,18,6],[17,5,18,5]]}
[]
[null,"RHDA Application for Gap Financing"]
[]
[null,"Project Information",null,null,null,"Developer Information"]
[]
[null,"Project Name",null,null,null,"Developer Name",null,null,null,null,null,null,null,null,null,null,null,null,null,"40 years",null,"Burnet Rd",1.02]
[null,null,null,null,null,"Co-Developer (If applicable)"]
[null,"Development Street Address",null,null,null,"Borrower (Legal Entity) Name"]
[null,"City, State","Austin, TX",null,null,"Developer Type (For or Non-Profit)"]
[null,"Development Zip Code"]
{"$rows_left_out":298}
{"sheet":"Unit Mix, Income, Timeline","index":7,"n_rows":63,"n_cols":28,"rows_kept":63,"cut":false,"hidden":false,"merged":[[36,8,36,12],[63,5,63,6],[1,14,1,16],[29,4,29,5],[28,4,28,5],[29,10,29,11],[28,10,28,11],[27,4,27,5],[27,10,27,11],[1,1,1,12],[62,5,62,6],[49,5,49,6],[50,5,50,6],[51,5,51,6],[52,5,52,6],[53,5,53,6],[54,5,54,6],[45,5,45,6],[46,5,46,6],[47,5,47,6],[48,5,48,6],[60,5,60,6],[55,5,55,6],[56,5,56,6],[57,5,57,6],[58,5,58,6],[59,5,59,6],[34,10,34,11],[33,10,33,11],[32,10,32,11],[30,4,30,5],[31,10,31,11],[30,10,30,11],[44,5,44,6],[36,1,36,7],[37,5,37,6],[38,5,38,6],[43,5,43,6],[42,5,42,6],[41,5,41,6],[40,5,40,6],[39,5,39,6]]}
[]
[null,"Unit Mix",null,null,null,null,null,null,null,null,null,null,null,null,"Construction Timeline"]
[null,"Median Family Income (MFI)","Unit Count","Bedrooms","Bathrooms","Per Unit Sq Ft","Total Sq Ft Unit Type","Fair Market Rent (FMR)","Voucher Rents","Max Allowable LIHTC Rent","Utility Allowance","Rent Collected per Unit","Total Rent Collected per Unit Type",null,"Site Control","Start Date","End Date"]
[null,null,null,null,null,null,{"$f":"IF(F4=\"\",\"\",F4*C4)","v":""},{"$f":"IF(D4=\"\",\"\",INDEX('MFI&FMR'!$M$6:$Q$6,MATCH('Unit Mix, Income, Timeline'!$D4,'MFI&FMR'!$M$5:$Q$5,0)))","v":""},null,{"$f":"IF(OR(B4=\"\",B4=\"MKT\"),\"\",INDEX('MFI&FMR'!$B$35:$J$45,MATCH('Unit Mix, Income, Timeline'!$B4,'MFI&FMR'!$B$35:$B$45,0),MATCH('Unit Mix, Income, Timeline'!$D4,'MFI&FMR'!$B$35:$J$35,0)))","v":""},null,null,{"$f":"IF(L4=\"\",\"\",L4*C4)","v":""},null,"Acquisition",null,"N/A "]
[null,null,null,null,null,null,"",{"$f":"IF(D5=\"\",\"\",INDEX('MFI&FMR'!$M$6:$Q$6,MATCH('Unit Mix, Income, Timeline'!$D5,'MFI&FMR'!$M$5:$Q$5,0)))","v":""},null,{"$f":"IF(OR(B5=\"\",B5=\"MKT\"),\"\",INDEX('MFI&FMR'!$B$35:$J$45,MATCH('Unit Mix, Income, Timeline'!$B5,'MFI&FMR'!$B$35:$B$45,0),MATCH('Unit Mix, Income, Timeline'!$D5,'MFI&FMR'!$B$35:$J$35,0)))","v":""},null,null,"",null,"Zoning"]
[null,null,null,null,null,null,"",{"$f":"IF(D6=\"\",\"\",INDEX('MFI&FMR'!$M$6:$Q$6,MATCH('Unit Mix, Income, Timeline'!$D6,'MFI&FMR'!$M$5:$Q$5,0)))","v":""},null,{"$f":"IF(OR(B6=\"\",B6=\"MKT\"),\"\",INDEX('MFI&FMR'!$B$35:$J$45,MATCH('Unit Mix, Income, Timeline'!$B6,'MFI&FMR'!$B$35:$B$45,0),MATCH('Unit Mix, Income, Timeline'!$D6,'MFI&FMR'!$B$35:$J$35,0)))","v":""},null,null,"",null,"Environmental Review"]
[null,null,null,null,null,null,"",{"$f":"IF(D7=\"\",\"\",INDEX('MFI&FMR'!$M$6:$Q$6,MATCH('Unit Mix, Income, Timeline'!$D7,'MFI&FMR'!$M$5:$Q$5,0)))","v":""},null,{"$f":"IF(OR(B7=\"\",B7=\"MKT\"),\"\",INDEX('MFI&FMR'!$B$35:$J$45,MATCH('Unit Mix, Income, Timeline'!$B7,'MFI&FMR'!$B$35:$B$45,0),MATCH('Unit Mix, Income, Timeline'!$D7,'MFI&FMR'!$B$35:$J$35,0)))","v":""},null,null,"",null,"Pre-Development"]
[null,null,null,null,null,null,"",{"$f":"IF(D8=\"\",\"\",INDEX('MFI&FMR'!$M$6:$Q$6,MATCH('Unit Mix, Income, Timeline'!$D8,'MFI&FMR'!$M$5:$Q$5,0)))","v":""},null,{"$f":"IF(OR(B8=\"\",B8=\"MKT\"),\"\",INDEX('MFI&FMR'!$B$35:$J$45,MATCH('Unit Mix, Income, Timeline'!$B8,'MFI&FMR'!$B$35:$B$45,0),MATCH('Unit Mix, Income, Timeline'!$D8,'MFI&FMR'!$B$35:$J$35,0)))","v":""},null,null,"",null,"Contract Execution",null,"N/A "]
[null,null,null,null,null,null,"",{"$f":"IF(D9=\"\",\"\",INDEX('MFI&FMR'!$M$6:$Q$6,MATCH('Unit Mix, Income, Timeline'!$D9,'MFI&FMR'!$M$5:$Q$5,0)))","v":""},null,{"$f":"IF(OR(B9=\"\",B9=\"MKT\"),\"\",INDEX('MFI&FMR'!$B$35:$J$45,MATCH('Unit Mix, Income, Timeline'!$B9,'MFI&FMR'!$B$35:$B$45,0),MATCH('Unit Mix, Income, Timeline'!$D9,'MFI&FMR'!$B$35:$J$35,0)))","v":""},null,null,"",null,"Closing of Other Financing"]
[null,null,null,null,null,null,"",{"$f":"IF(D10=\"\",\"\",INDEX('MFI&FMR'!$M$6:$Q$6,MATCH('Unit Mix, Income, Timeline'!$D10,'MFI&FMR'!$M$5:$Q$5,0)))","v":""},null,{"$f":"IF(OR(B10=\"\",B10=\"MKT\"),\"\",INDEX('MFI&FMR'!$B$35:$J$45,MATCH('Unit Mix, Income, Timeline'!$B10,'MFI&FMR'!$B$35:$B$45,0),MATCH('Unit Mix, Income, Timeline'!$D10,'MFI&FMR'!$B$35:$J$35,0)))","v":""},null,null,"",null,"Development Services Review"]
{"$rows_left_out":54}
{"sheet":"Sources & Uses","index":8,"n_rows":32,"n_cols":17,"rows_kept":32,"cut":false,"hidden":false,"merged":[[19,12,19,13],[24,5,24,6],[25,5,25,6],[26,5,26,6],[24,7,24,9],[25,7,25,9],[26,7,26,9],[11,5,11,6],[20,7,20,10],[11,7,11,10],[22,5,22,6],[23,5,23,6],[21,7,21,9],[22,7,22,9],[23,7,23,9],[21,5,21,6],[20,5,20,6],[12,7,12,8],[13,7,13,8],[14,7,14,8],[16,7,16,8],[15,7,15,8],[27,5,27,6],[28,5,28,6],[29,5,29,6],[28,7,28,9],[29,7,29,9],[27,7,27,9],[1,1,1,10],[1,15,1,16],[2,15,2,16],[2,5,2,6],[2,7,2,10],[1,12,1,13],[2,12,2,13]]}
[]
[null,"Sources",null,null,null,null,null,null,null,null,null,null,"Sources (Permanent Phase)",null,null,"Uses"]
[null,"Hard Debt Service Financing",null,null,null,"Construction Period",null,"Permanent Period",null,null,null,null,"Financing Sources*",null,null,"Development Costs"]
[null,"Type of Funds","Source of Funds","Committed? (Yes, No, or App Pending)","If No, Additional Details","Interest Rate","Total Amount","Annual Payment","Interest Rate","Loan Term","Total Amount",null,"Debt",0,null,"Acquisition Costs",{"$f":"'Development Costs'!$C$11","v":0}]
[null,"Construction Loan","Construction Loan Bank 1",null,null,null,null,null,null,null,null,null,"Equity",0,null,"Pre-Development Costs",{"$f":"'Development Costs'!C17","v":0}]
[null,"First Mortgage","Mortgage Bank 1",null,null,null,null,null,null,null,null,null,"Grant",0,null,"Construction / Rehabilitation Costs",{"$f":"SUM('Development Costs'!$C$44-'Development Costs'!$C$39)","v":0}]
[null,"Second Mortgage","Mortgage Bank 2",null,null,null,null,null,null,null,null,null,"Other  ",0,null,"General Contractor Overhead & Profit",{"$f":"'Development Costs'!$C$39","v":0}]
[null,"Third Mortgage","Mortgage Bank 3",null,null,null,null,null,null,null,null,null,"AHFC Funding Request",0,null,"Construction Interest",{"$f":"'Development Costs'!$C$52","v":0}]
[null,"Etc… Please Label","Mortgage Bank 3",null,null,null,null,null,null,null,null,null,"Previous AHFC Funding Award",0,null,"Permanent Financing Costs",{"$f":"'Development Costs'!C55","v":0}]
[null,null,null,null,null,null,"Total Hard Debt Service:",{"$f":"SUM(H6:H9)","v":0},null,"Total Hard Debt:",{"$f":"SUM(K6:K9)","v":0},null,"Other",0,null,"Developer's Fee",{"$f":"'Development Costs'!$C$46","v":0}]
{"$rows_left_out":23}
{"sheet":"Development Costs","index":9,"n_rows":72,"n_cols":6,"rows_kept":72,"cut":false,"hidden":false,"merged":[[3,1,3,3],[44,1,44,3],[1,1,1,3],[69,2,69,3],[64,1,64,3],[65,1,65,3],[66,2,66,3],[67,2,67,3],[68,2,68,3],[64,5,64,7],[66,5,66,7],[68,5,68,7],[17,1,17,3],[71,5,75,7]]}
[]
[null,"Development Budget",null,null,null,"LIHTC Basis"]
[null,null,"Project Cost","Requested AHFC Funds",null,"Amount Included in LIHTC Basis"]
[null,"Pre-Development"]
[null,"Appraisal",null,null,null,{"$f":"C5","v":0}]
[null,"Environmental Review",null,null,null,0]
[null,"Engineering",null,null,null,0]
[null,"Survey",null,null,null,0]
[null,"Architectural",null,null,null,0]
[null,"Other Pre-Development Costs (Detailed Description*)",null,null,null,0]
{"$rows_left_out":63}
{"sheet":"ProForma","index":10,"n_rows":92,"n_cols":22,"rows_kept":92,"cut":false,"hidden":false,"merged":[[20,1,20,2],[26,1,26,2],[1,1,1,3]]}
[]
[null,"Year 1 Annual Operating Expense Assumptions"]
[null,"Expense Item","Annual Amount","Exp. Per Unit"]
[null,"General & Administrative",null,{"$f":"C4/'Unit Mix, Income, Timeline'!$C$28","v":{"$error":"#DIV/0!"}}]
[null,"Management Fee",null,{"$f":"C5/'Unit Mix, Income, Timeline'!$C$28","v":{"$error":"#DIV/0!"}}]
[null,"Management Fee % of Total Rent",{"$f":"C5/(SUM(ProForma!C37:C39))","v":{"$error":"#DIV/0!"}}]
[null,"Employee Payroll",null,{"$f":"C7/'Unit Mix, Income, Timeline'!$C$28","v":{"$error":"#DIV/0!"}}]
[null,"Repairs & Maintenance",null,{"$f":"C8/'Unit Mix, Income, Timeline'!$C$28","v":{"$error":"#DIV/0!"}}]
[null,"Contracted Services",null,{"$f":"C9/'Unit Mix, Income, Timeline'!$C$28","v":{"$error":"#DIV/0!"}}]
[null,"Electric & Gas Utilities ",null,{"$f":"C10/'Unit Mix, Income, Timeline'!$C$28","v":{"$error":"#DIV/0!"}}]
{"$rows_left_out":82}