{"text_format":"1","workbook":"xlsx","n_sheets":15,"sheets":["SIF Calculator Instructions","SIF Calculator Input","Summary of Roadway Costs","ROW Dedication & Easement","SIF Offset Estimate","Service Area","Land_Use_Descriptions","Max_Rate","Collected_Rate","TDM Instructions","TDM Calculator Input","Point & Trip Red. Look-up Table","Proposed TDM Plan Point Credits","Proposed TDM Plan Trip Red. %","Revised_LUVMET"],"not_rendered":{"charts":0,"images":3,"macros":1,"external_links":1,"defined_names":15,"comments":1,"pivot_tables":0},"unopened":[],"bounds":{"document_bytes":16777216,"sheet_cells":100000,"rows_first":2000,"rows_last":500,"rows_between":2000,"halvings":0,"cell_chars":16384,"cell_head_chars":4096},"cells_cut":0,"cells_raw":0,"read":"whole","date_system":"1900"}

{"sheet":"SIF Calculator Instructions","index":0,"n_rows":42,"n_cols":4,"rows_kept":42,"cut":false,"hidden":false,"merged":[]}
[]
[]
[]
[]
[]
[]
{"$rows_left_out":37}
{"sheet":"SIF Calculator Input","index":1,"n_rows":156,"n_cols":43,"rows_kept":156,"cut":false,"hidden":false,"merged":[[119,1,119,24],[64,2,75,9],[64,11,64,13],[65,11,65,13],[66,11,66,13],[67,11,67,13],[114,3,114,22],[69,19,69,23],[115,3,115,22],[37,1,38,11],[62,3,63,15],[62,16,63,24],[112,3,112,22],[113,3,113,22],[41,16,41,18],[17,30,17,31],[129,0,129,25],[19,16,19,18],[61,1,61,16],[100,3,100,22],[101,3,101,22],[102,3,102,22],[103,3,103,22],[104,3,104,22],[111,3,111,22],[122,16,122,24],[123,18,123,21],[18,30,18,31],[65,24,67,24],[65,22,67,23],[41,22,41,24],[15,1,16,1],[15,2,16,24],[19,22,19,24],[2,0,2,24],[6,2,6,24],[8,2,8,3],[5,2,5,24],[7,2,7,24],[12,3,12,6],[13,3,13,6],[9,2,9,3],[8,5,8,7],[8,21,8,24],[8,8,8,15]]}
[]
[null,null,null,null,null,null,null,null,null,null,null,null,null,null,null,null,null,null,null,null,null,null,null,null,"Street Impact Fee Calculation Worksheet"]
["City of Austin, Texas"]
[null,null,null,null,null,null,null,null,null,null,null,null,null,null,null,null,null,null,null,null,null,null,null,null,"http://www.austintexas.gov/department/street-impact-fee"]
[null,null,null,null,null,null,null,null,null,null,null,null,null,null,null,null,null,null,null,null,null,null,null,null,null,null,null,null,null,"Building Permit ",null,{"$f":"SUM(AE7:AM7)","v":0}]
[null,"Development Name:",null,null,null,null,null,null,null,null,null,null,null,null,null,null,null,null,null,null,null,null,null,null,null,null,null,null,null,"Assessment Date","2018-03-29",{"$f":"IF(D13=\"\",\"\",IF(D14=\"\",\"\",IF(D14>=DATE(2019,1,1),2,1)))","v":""},{"$f":"IF(D13=\"\",\"\",IF(D14=\"\",\"\",IF(D13<DATE(2013,4,1),1,IF(D13>=DATE(2018,4,1),3,2))))","v":""}]
{"$rows_left_out":151}
{"sheet":"Summary of Roadway Costs","index":2,"n_rows":29,"n_cols":9,"rows_kept":29,"cut":false,"hidden":true,"merged":[[18,1,18,4],[0,0,0,7],[1,0,17,0],[2,1,2,7],[16,1,16,7],[17,1,17,4]]}
["Austin / Travis County Proportionality Worksheet - Summary of Costs"]
[null,"Classification","Capacity (vphpl)","Number of Lanes","Cost per Mile \n(for use in Demand Calculations)","% of Roadway Network for Each Facility Type","Cost Per Vehicle Mile (Demand)","Cost Per Foot Per Lane"]
[]
[null,"Level 1",330,2,3718980.9066666663,null,{"$f":"ROUND(E4/(D4*C4),0)","v":5635},{"$f":"ROUNDDOWN((E4/5280)/D4,2)","v":352.17}]
[null,"Level 1 Alternative",330,2,3344535.04,null,{"$f":"ROUND(E5/(D5*C5),0)","v":5067},316.70999999999998]
[null,"Level 2 Industrial",330,2,5359153.0666666673,null,{"$f":"ROUND(E6/(D6*C6),0)","v":8120},507.49]
{"$rows_left_out":24}
{"sheet":"ROW Dedication & Easement","index":3,"n_rows":24,"n_cols":6,"rows_kept":24,"cut":false,"hidden":false,"merged":[[1,1,1,5],[12,1,12,5]]}
[]
[null,"RIGHT-OF-WAY DEDICATION - ROW TO BE DEDICATED BY THE APPLICANT"]
[]
[null,"Road Name","Description of ROW Dedication","Dedicated Land Area (sf)","Land Value ($/sf)*","ROW Dedication Value ($)"]
[null,null,null,null,null,{"$f":"E5*D5","v":0}]
[null,null,null,null,null,{"$f":"E6*D6","v":0}]
{"$rows_left_out":19}
{"sheet":"SIF Offset Estimate","index":4,"n_rows":27,"n_cols":21,"rows_kept":27,"cut":false,"hidden":false,"merged":[[18,1,18,10],[9,13,9,15],[10,13,10,15],[11,13,11,15]]}
[]
[null,"SIF offset estimate for item constructed by the applicant*"]
[]
[null,"Item Name","Road/Intersection Name","ASMP Road Level(s)","Unit","Cost ($)/unit","Counts if applicable","Length (ft) if applicable","Width (ft) if applicable","Units Constructed","Cost per item ($)",null,"ASMP Road Level","TCM Sidewalk Width","TCM Bike Lane Width","TCM SUP Width (no curb & gutter)",null,"SL","Item","Unit","Cost ($)/Unit"]
[null,null,null,null,{"$f":"IF(B5=\"\",\"\",VLOOKUP(B5,$S$5:$U$18,2,FALSE))","v":""},{"$f":"IF(B5=\"\",\"\",VLOOKUP(B5,$S$5:$U$18,3,FALSE))","v":""},null,null,null,{"$f":"IF(B5=\"\",\"\",IF(E5=\"Count\", G5,IF(E5=\"LF\",H5,IF(E5=\"SF\",H5*I5))))","v":""},{"$f":"IF(B5=\"\",\"\",J5*F5)","v":""},null,1,5,null,null,null,1,"Sidewalk","SF",24]
[null,null,null,null,{"$f":"IF(B6=\"\",\"\",VLOOKUP(B6,$S$5:$U$18,2,FALSE))","v":""},{"$f":"IF(B6=\"\",\"\",VLOOKUP(B6,$S$5:$U$18,3,FALSE))","v":""},null,null,null,{"$f":"IF(B6=\"\",\"\",IF(E6=\"Count\", G6,IF(E6=\"LF\",H6,IF(E6=\"SF\",H6*I6))))","v":""},{"$f":"IF(B6=\"\",\"\",J6*F6)","v":""},null,2,6,7,12,null,2,"SUP","SF",30]
{"$rows_left_out":22}
{"sheet":"Service Area","index":5,"n_rows":0,"n_cols":0,"rows_kept":0,"cut":false,"hidden":false,"merged":[]}

{"sheet":"Land_Use_Descriptions","index":6,"n_rows":81,"n_cols":4,"rows_kept":81,"cut":false,"hidden":false,"merged":[]}
[null,"Land Use Category","ITE Land Use Code","Land Use Description"]
[]
[]
[]
[null,"PORT AND TERMINAL"]
[null,"Truck Terminal","030","Point of goods transfer between trucks, between trucks and rail, or between trucks and ports"]
{"$rows_left_out":76}
{"sheet":"Max_Rate","index":7,"n_rows":82,"n_cols":27,"rows_kept":82,"cut":false,"hidden":true,"merged":[[1,1,1,3]]}
[]
[null,"Land Use Category",null,null,"ITE Land Use Code","Land Use Description","Development Unit","Veh-Mi Per Dev-Unit Inside Loop","Veh-Mi Per Dev-Unit Outside Loop","Max Fee Per Dev-Unit\nSA A\n","Max Fee Per Dev-Unit\nSA B\n","Max Fee Per Dev-Unit\nSA C\n","Max Fee Per Dev-Unit\nSA D\n","Max Fee Per Dev-Unit\nSA E\n","Max Fee Per Dev-Unit\nSA F\nINSIDE","Max Fee Per Dev-Unit\nSA G\n","Max Fee Per Dev-Unit\nSA H\n","Max Fee Per Dev-Unit\nSA I\nINSIDE","Max Fee Per Dev-Unit\nSA J\nINSIDE","Max Fee Per Dev-Unit\nSA K\nINSIDE","Max Fee Per Dev-Unit\nSA L\nINSIDE","Max Fee Per Dev-Unit\nSA M\n","Max Fee Per Dev-Unit\nSA N\n","Max Fee Per Dev-Unit\nSA O\n","Max Fee Per Dev-Unit\nSA P\n","Max Fee Per Dev-Unit\nSA DT\nINSIDE"]
[]
[{"$f":"Collected_Rate!A4","v":"PORT AND TERMINAL"},"PORT AND TERMINAL",null,null,null,null,null,null,null,1472,4479,3642,2218,2043,1604,3071,1543,1712,3742,5752,2520,2415,1507,3921,3011,1361]
[{"$f":"Collected_Rate!A5","v":"(030) Truck Terminal"},"Truck Terminal",null,null,"030","Point of good transfer between trucks or between trucks and rail","1,000 SF GFA",10,10,{"$f":"ROUND($J$4*I5,2)","v":14720},{"$f":"ROUND(K$4*$I5,2)","v":44790},{"$f":"ROUND(L$4*$I5,2)","v":36420},{"$f":"ROUND(M$4*$I5,2)","v":22180},20430,{"$f":"ROUND(O$4*$H5,2)","v":16040},30710,15430,{"$f":"ROUND(R$4*$H5,2)","v":17120},{"$f":"ROUND(S$4*$H5,2)","v":37420},{"$f":"ROUND(T$4*$I5,2)","v":57520},{"$f":"ROUND(U$4*$H5,2)","v":25200},24150,15070,39210,30110,{"$f":"ROUND(Z$4*$H5,2)","v":13610}]
[{"$f":"Collected_Rate!A6","v":"INDUSTRIAL"},"INDUSTRIAL",null,null,null,null,null,null,null,{"$f":"ROUND($J$4*I6,2)","v":0},{"$f":"ROUND(K$4*$I6,2)","v":0},0,0,0,{"$f":"ROUND(O$4*$H6,2)","v":0},0,0,{"$f":"ROUND(R$4*$H6,2)","v":0},0,{"$f":"ROUND(T$4*$I6,2)","v":0},{"$f":"ROUND(U$4*$H6,2)","v":0},0,0,0,0,{"$f":"ROUND(Z$4*$H6,2)","v":0}]
{"$rows_left_out":77}
{"sheet":"Collected_Rate","index":8,"n_rows":82,"n_cols":41,"rows_kept":82,"cut":false,"hidden":false,"merged":[[1,1,1,3]]}
[]
[null,"Land Use Category",null,null,"ITE Land Use Code","Land Use Description","Development Unit","Trip Gen Rate (PM)","Pass-by Rate","Pass-by Source","Trip Rate","Trip Length Inside Loop (mi)","Trip Length Outside Loop (mi)","Modeled Trip Length Source","NCTCOG Trip Length (mi)","Adj. For     O-D","Adj. Trip Length Inside Loop (mi)","Adj. Trip Length Oustide Loop (mi)","Max Trip Length Inside Loop (mi)","Max Trip Length Oustide Loop (mi)","Veh-Mi Per Dev-Unit Inside Loop",null,"Collection Fee Per Dev-Unit\nSA A\n","Collection Fee Per Dev-Unit\nSA B\n","Collection Fee Per Dev-Unit\nSA C\n","Collection Fee Per Dev-Unit\nSA D\n","Collection Fee Per Dev-Unit\nSA E\n","Collection Fee Per Dev-Unit\nSA F\n","Collection Fee Per Dev-Unit\nSA G\n","Collection Fee Per Dev-Unit\nSA H\n","Collection Fee Per Dev-Unit\nSA I\n","Collection Fee Per Dev-Unit\nSA J\n","Collection Fee Per Dev-Unit\nSA K\nINSIDE           SL 360","Collection Fee Per Dev-Unit\nSA K\nOUTSIDE       SL 360","Collection Fee Per Dev-Unit\nSA L\n","Collection Fee Per Dev-Unit\nSA M\n","Collection Fee Per Dev-Unit\nSA N\n","Collection Fee Per Dev-Unit\nSA O\n","Collection Fee Per Dev-Unit\nSA P\n","Collection Fee Per Dev-Unit\nSA DT\n"]
[null,null,null,null,null,null,null,null,null,null,null,null,null,null,null,null,null,null,null,null,null,null,null,null,null,null,null,null,null,null,null,null,null,null,null,null,null,null,null,null,850]
[{"$f":"IF(ISBLANK(E4),B4,CONCATENATE(\"(\",E4,\") \",B4))","v":"PORT AND TERMINAL"},"PORT AND TERMINAL",null,null,null,null,null,null,null,null,null,null,null,null,null,null,null,null,null,null,null,null,null,null,null,null,null,null,null,null,null,null,null,null,null,null,null,null,null,null,1215]
["(030) Truck Terminal","Truck Terminal",null,null,"030","Point of good transfer between trucks or between trucks and rail","1,000 SF GFA",1.87,null,null,1.87,10.7,10.7,"RPA",10.02,0.5,5.35,5.35,5.35,5.35,10,null,12150,12150,12150,12150,12150,12150,12150,12150,12150,12150,12150,12150,12150,12150,12150,12150,12150,12150]
["INDUSTRIAL","INDUSTRIAL"]
{"$rows_left_out":77}
{"sheet":"TDM Instructions","index":9,"n_rows":31,"n_cols":3,"rows_kept":31,"cut":false,"hidden":false,"merged":[[1,1,1,14],[2,1,26,14]]}
[]
[null,"TDM Points and Trip Reduction Calculator Instructions"]
[null,"Applicability Note – For developments that generate less than 2,000 unadjusted daily trips, TDM is not required. TDM measures may still be performed to achieve a trip reduction % and entered into the calculator.\n1. For information related to TDM measures and implementation levels and TDM Plan points requirements, please see the Transportation Criteria Manual Section 10. See the tab “Point & Trip Red. Look-up Table” for details of TDM points and % Trip Reductions associated with each TDM measure implementation level and context area (Downtown, Urban, or Urban Transition).\n2. Context Areas are based upon boundaries from the Street Impact Fee study and University Neighborhood Overlay District. See the “Service Area” tab to locate the development’s context area and see “Resource Links” section below for a map of the University Neighborhood Overlay District.\n3. Fill in all of the beige fields for the proposed TDM measures and implementation levels using drop down menus in the “TDM Calculator Input” tab. For sites where internal capture is applicable, a % reduction in trips approved by applicable staff shall be manually entered on the “TDM Calculator Input” tab. Instructions are provided in each cell if an entry must be selected from a drop-down menu or manual entry. For developments that do not require TDM Plans, only the TDM measures being used may be filled in on the Calculator to determine a % trip reduction. At a minimum, the “Context Area” and one TDM measure must be filled in.\n4. The section of the tab marked “Sustainable Mode Improvement Measures” must be filled in by staff and is related to infrastructure improvements related to TDM."]
[]
[]
[]
{"$rows_left_out":26}
{"sheet":"TDM Calculator Input","index":10,"n_rows":67,"n_cols":23,"rows_kept":67,"cut":false,"hidden":false,"merged":[[0,0,0,3],[1,0,1,1],[2,0,2,1],[3,0,3,1],[4,0,5,1],[4,2,5,2],[4,3,5,3],[58,1,58,3],[25,0,27,0],[28,0,30,0],[57,0,57,1],[25,3,27,3],[28,3,30,3]]}
["TDM Points and Trip Reduction Calculator"]
["Project Name:",null,"Legal Description (Lot, Block)","Project Number:"]
[{"$f":"IF(E38=\"\", \"Enter Project Name Here\")","v":"Enter Project Name Here"},null,{"$f":"IF(E38=\"\", \"Enter Legal Desc. Here\")","v":"Enter Legal Desc. Here"},{"$f":"IF(E38=\"\", \"Enter Project Number Here\")","v":"Enter Project Number Here"}]
["Project Description:",null,"Applicant's Name:","Contact Info (phone number/e-mail):"]
[{"$f":"IF(E38=\"\", \"Enter Project Description Here\")","v":"Enter Project Description Here"},null,{"$f":"IF(E38=\"\", \"Enter Applicant Name Here\")","v":"Enter Applicant Name Here"},{"$f":"IF(E38=\"\", \"Enter Contact Info Here\")","v":"Enter Contact Info Here"}]
[]
{"$rows_left_out":62}
{"sheet":"Point & Trip Red. Look-up Table","index":11,"n_rows":136,"n_cols":14,"rows_kept":136,"cut":false,"hidden":false,"merged":[[2,2,5,2],[2,3,5,3],[6,1,9,1],[7,2,9,2],[7,3,9,3],[10,1,14,1],[0,10,1,12],[26,0,74,0],[75,0,135,0],[0,1,1,1],[0,2,1,2],[0,3,1,3],[0,4,1,4],[0,6,0,8],[2,0,9,0],[2,1,5,1],[11,0,25,0],[11,2,14,2],[11,3,14,3],[22,1,25,1],[23,2,25,2],[23,3,25,3],[15,3,18,3],[15,2,18,2],[19,2,21,2],[19,3,21,3],[26,1,27,1],[28,1,29,1],[30,1,31,1],[32,1,34,1],[33,2,34,2],[64,3,65,3],[66,1,68,1],[67,2,68,2],[67,3,68,3],[33,3,34,3],[35,1,48,1],[37,2,48,2],[37,3,48,3],[49,1,62,1],[51,2,62,2],[63,1,65,1],[64,2,65,2],[51,3,62,3],[69,1,70,1],[71,1,72,1],[73,1,74,1],[75,1,85,1],[76,2,85,2],[76,3,85,3],[86,1,96,1],[87,2,96,2],[87,3,96,3],[125,3,129,3],[130,1,135,1],[131,2,135,2],[131,3,135,3],[98,3,112,3],[113,1,123,1],[114,2,123,2],[114,3,123,3],[97,1,112,1],[98,2,112,2],[124,1,129,1],[125,2,129,2]]}
[null,"Measure","Description","Implementation Options","Points Credit","Blank (Do not edit cells in this column)","Proposed TIA Trip Reduction % AND Rough Proportionality Credit %",null,null,"Blank (Do not edit cells in this column)","Approved Trip-Reduction Credit Criteria"]
[null,null,null,null,null,null,"Downtown","Urban","Urban Transition"]
["Contextual Trip Reduction Measures","Internal Trip Capture (CTR-1)","Include a mix of land uses to optimize internal-capture trip-reduction opportunities, providing residents and/or employees with on-site access to housing/jobs, goods, and services. ","This measure may be implemented to receive between 5 and 20 points in credit toward meeting TDM Plan points requirements, with one point received for each % of trips estimated to be captured internally (round down to nearest 5% for selecting category (i.e. 5-9% = 5 points / 5%, 10-14% = 10 points, 10 %, etc.), based on the amount agreed to by the City.",5,null,"5-9%","5-9%","5-9%",null,0.04,0.1]
[null,null,null,null,10,null,"10-14%","10-14%","10-14%",null,0.09,0.15]
[null,null,null,null,15,null,"15-19%","15-19%","15-19%",null,0.14000000000000001,0.2]
[null,null,null,null,20,null,"More than 20%","More than 20%","More than 20%",null,0.19,1]
{"$rows_left_out":131}
{"sheet":"Proposed TDM Plan Point Credits","index":12,"n_rows":59,"n_cols":4,"rows_kept":59,"cut":false,"hidden":true,"merged":[[8,0,8,2],[9,0,9,2],[0,0,0,2],[1,0,2,0],[1,1,2,1],[1,2,2,2],[3,0,3,2],[4,2,7,2],[50,1,50,3],[18,2,30,2],[16,0,16,2],[17,0,17,2],[10,2,15,2],[31,0,31,2],[32,0,32,2],[33,2,40,2],[49,0,49,1]]}
["Proposed TDM Plan Point Credits"]
["Measures","Proposed TDM Plan Point Credit","Maximum Points Allowed"]
[]
["Contextual Trip Reduction Measures"]
["Internal Trip Capture (CTR-1)",{"$f":"IF(AND('TDM Calculator Input'!D10<'Point & Trip Red. Look-up Table'!L3, 'TDM Calculator Input'!D10>'Point & Trip Red. Look-up Table'!K3), 'Point & Trip Red. Look-up Table'!E3, IF(AND('TDM Calculator Input'!D10<'Point & Trip Red. Look-up Table'!L4, 'TDM Calculator Input'!D10>'Point & Trip Red. Look-up Table'!K4), 'Point & Trip Red. Look-up Table'!E4, IF(AND('TDM Calculator Input'!D10<'Point & Trip Red. Look-up Table'!L5, 'TDM Calculator Input'!D10>'Point & Trip Red. Look-up Table'!K5), 'Point & Trip Red. Look-up Table'!E5,  IF(AND('TDM Calculator Input'!D10<'Point & Trip Red. Look-up Table'!L6, 'TDM Calculator Input'!D10>'Point & Trip Red. Look-up Table'!K6), 'Point & Trip Red. Look-up Table'!E6, 0))))","v":0},20]
["Transit Proximity (CTR-2)",{"$f":"IF('TDM Calculator Input'!C11='Point & Trip Red. Look-up Table'!K8,'Point & Trip Red. Look-up Table'!E8, IF('TDM Calculator Input'!C11='Point & Trip Red. Look-up Table'!K9,'Point & Trip Red. Look-up Table'!E9, IF('TDM Calculator Input'!C11='Point & Trip Red. Look-up Table'!K10,'Point & Trip Red. Look-up Table'!E10)))","v":false}]
{"$rows_left_out":54}
{"sheet":"Proposed TDM Plan Trip Red. %","index":13,"n_rows":61,"n_cols":6,"rows_kept":61,"cut":false,"hidden":true,"merged":[[8,0,9,3],[10,3,14,3],[15,0,16,3],[0,0,0,3],[1,0,2,0],[1,1,2,1],[1,3,2,3],[3,0,4,3],[5,3,7,3],[17,3,28,3],[29,0,30,3],[55,3,60,3],[38,0,38,3],[39,0,40,3],[41,3,45,3],[46,0,47,3],[48,3,52,3],[53,0,54,3],[31,3,37,3]]}
["Proposed TIA Trip Reduction %"]
["Measures","Trip Reduction %",null,"Maximum % Reduction Allowed"]
[]
["Contextual Trip Reduction"]
[]
["Internal Trip Capture (CTR-1)",{"$f":"IF('TDM Calculator Input'!D10=\"Manually enter agreed-to trip reduction % here\", 0%,'TDM Calculator Input'!D10)","v":0},null,{"$f":"IF('TDM Calculator Input'!$C$8=\"Downtown\", 40%, IF('TDM Calculator Input'!$C$8=\"Urban\", 30%, IF('TDM Calculator Input'!$C$8=\"Urban Transition\", 25%, 0)))","v":0}]
{"$rows_left_out":56}
{"sheet":"Revised_LUVMET","index":14,"n_rows":82,"n_cols":40,"rows_kept":82,"cut":false,"hidden":true,"merged":[[1,1,1,3]]}
[]
[null,"Land Use Category",null,null,"ITE Land Use Code","Land Use Description","Development Unit","Trip Gen Rate (PM)","Pass-by Rate","Pass-by Source","Trip Rate","Trip Length Inside Loop (mi)","Trip Length Outside Loop (mi)","Modeled Trip Length Source","NCTCOG Trip Length (mi)","Adj. For     O-D","Adj. Trip Length Inside Loop (mi)","Adj. Trip Length Oustide Loop (mi)","Max Trip Length Inside Loop (mi)","Max Trip Length Oustide Loop (mi)","Veh-Mi Per Dev-Unit Inside Loop",null,"Collection Fee Per Dev-Unit\nSA A\n","Collection Fee Per Dev-Unit\nSA B\n","Collection Fee Per Dev-Unit\nSA C\n","Collection Fee Per Dev-Unit\nSA D\n","Collection Fee Per Dev-Unit\nSA E\n","Collection Fee Per Dev-Unit\nSA F\n","Collection Fee Per Dev-Unit\nSA G\n","Collection Fee Per Dev-Unit\nSA H\n","Collection Fee Per Dev-Unit\nSA I\n","Collection Fee Per Dev-Unit\nSA J\n","Collection Fee Per Dev-Unit\nSA K\n","Collection Fee Per Dev-Unit\nSA L\n","Collection Fee Per Dev-Unit\nSA M\n","Collection Fee Per Dev-Unit\nSA N\n","Collection Fee Per Dev-Unit\nSA O\n","Collection Fee Per Dev-Unit\nSA P\n","Collection Fee Per Dev-Unit\nSA DT\n"]
[]
[null,"PORT AND TERMINAL"]
[null,"Truck Terminal",null,null,"030","Point of good transfer between trucks or between trucks and rail","1,000 SF GFA",1.87,null,null,1.87,10.7,10.7,"RPA",10.02,0.5,5.35,5.35,5.35,5.35,10,null,7360,22395,18210,11090,10215,8020,15355,7715,8560,18620,28760,12600,12075,7535,19605,15055,6805]
[null,"INDUSTRIAL"]
{"$rows_left_out":76}